{
  "data_qualities": {
    "quality": [
      {
        "name": "AutoCorrelation",
        "value": []
      },
      {
        "name": "Dimensionality",
        "value": "1.8340000687750026E-4"
      },
      {
        "name": "MajorityClassPercentage",
        "value": []
      },
      {
        "name": "MajorityClassSize",
        "value": []
      },
      {
        "name": "MinorityClassPercentage",
        "value": []
      },
      {
        "name": "MinorityClassSize",
        "value": []
      },
      {
        "name": "NumberOfBinaryFeatures",
        "value": "0.0"
      },
      {
        "name": "NumberOfClasses",
        "value": []
      },
      {
        "name": "NumberOfFeatures",
        "value": "16.0"
      },
      {
        "name": "NumberOfInstances",
        "value": "87241.0"
      },
      {
        "name": "NumberOfInstancesWithMissingValues",
        "value": "87241.0"
      },
      {
        "name": "NumberOfMissingValues",
        "value": "472864.0"
      },
      {
        "name": "NumberOfNumericFeatures",
        "value": "6.0"
      },
      {
        "name": "NumberOfSymbolicFeatures",
        "value": "0.0"
      },
      {
        "name": "PercentageOfBinaryFeatures",
        "value": "0.0"
      },
      {
        "name": "PercentageOfInstancesWithMissingValues",
        "value": "100.0"
      },
      {
        "name": "PercentageOfMissingValues",
        "value": "33.876273770360264"
      },
      {
        "name": "PercentageOfNumericFeatures",
        "value": "37.5"
      },
      {
        "name": "PercentageOfSymbolicFeatures",
        "value": "0.0"
      }
    ]
  }
}