{
  "data_set_description": {
    "collection_date": "06-08-2017",
    "description": "Context\nTumor microRNA expression profiling identifies circulating microRNAs for earlier breast cancer detection.\nDue to microRNA role in tumorigenesis and remarkable stability in body fluids, microRNAs (miRNAs) are emerging as a promising diagnostic tool. The aim of this study was to identify tumor miRNA signatures for the discrimination of breast cancer and the intrinsic molecular subtypes, and the study in plasma of the status of the most significant ones in order to identify potential circulating biomarkers for breast cancer detection.\nhttps://www.ncbi.nlm.nih.gov/geo/query/acc.cgi?acc=GSE58606\nContent\nThe cols are each microRNA name and the rows are the samples. The values are microarray expression data.\nAcknowledgements\nMatamala N, Vargas MT, Gonzlez-Cmpora R, Miambres R et al. Tumor microRNA expression profiling identifies circulating microRNAs for early breast cancer detection. Clin Chem 2015 Aug;61(8):1098-106. PMID: 26056355\nInspiration\nUse this data to practice making predictive models from machine learning/deep learning algorithms on gene expression profiling data.",
    "description_version": "1",
    "file_id": "22102552",
    "format": "arff",
    "id": "43727",
    "language": "English",
    "licence": "CC0: Public Domain",
    "md5_checksum": "d118289dc6dac992f82729e444ac06d1",
    "minio_url": "https://data.openml.org/datasets/0004/43727/dataset_43727.pq",
    "name": "Primary-breast-cancer-vs-Normal-breast-tissue",
    "parquet_url": "https://data.openml.org/datasets/0004/43727/dataset_43727.pq",
    "processing_date": "2022-03-24 07:42:04",
    "status": "active",
    "upload_date": "2022-03-24T07:41:46",
    "url": "https://api.openml.org/data/v1/download/22102552/Primary-breast-cancer-vs-Normal-breast-tissue.arff",
    "version": "2",
    "version_label": "v1.0",
    "visibility": "public"
  }
}