{
  "data_set_description": {
    "collection_date": "24-10-2017",
    "default_target_attribute": "Price",
    "description": "Context\nSome camera enthusiast went and described 1,000 cameras based on 13 properties! \nContent\nRow one describes the datatype for each column and can probably be removed.\nThe 13 properties of each camera:\n\nModel\nRelease date\nMax resolution\nLow resolution\nEffective pixels\nZoom wide (W)\nZoom tele (T)\nNormal focus range\nMacro focus range\nStorage included\nWeight (inc. batteries)\nDimensions\nPrice\n\nAcknowledgements\nThese datasets have been gathered and cleaned up by Petra Isenberg, Pierre Dragicevic and Yvonne Jansen.  The original source can be found here.\nThis dataset has been converted to CSV.",
    "description_version": "1",
    "file_id": "22102539",
    "format": "arff",
    "id": "43714",
    "language": "English",
    "licence": "CC BY-SA 3.0",
    "md5_checksum": "3bbcf1161cf7fb55bb4a03cce98cf239",
    "minio_url": "https://data.openml.org/datasets/0004/43714/dataset_43714.pq",
    "name": "1000-Cameras-Dataset",
    "parquet_url": "https://data.openml.org/datasets/0004/43714/dataset_43714.pq",
    "processing_date": "2022-03-24 07:32:16",
    "status": "active",
    "upload_date": "2022-03-24T07:31:36",
    "url": "https://api.openml.org/data/v1/download/22102539/1000-Cameras-Dataset.arff",
    "version": "1",
    "version_label": "v1.0",
    "visibility": "public"
  }
}