{
  "data_set_description": {
    "collection_date": "01-03-2017",
    "description": "Context\nPantheon is a project celebrating the cultural information that endows our species with these fantastic capacities. To celebrate our global cultural heritage we are compiling, analyzing and visualizing datasets that can help us understand the process of global cultural development. Dive in, visualize, and enjoy.\nContent\nThe Pantheon 1.0 data measures the global popularity of historical characters using two measures. The simpler of the two measures, which we denote as L, is the number of different Wikipedia language editions that have an article about a historical character. The more sophisticated measure, which we name the Historical Popularity Index (HPI) corrects L by adding information on the age of the historical character, the concentration of page views among different languages, the coefficient of variation in page views, and the number of page views in languages other than English.\nFor annotations of specific values visit the column metadata in the /Data tab. A more comprehensive breakdown is available on the Parthenon website.\nAcknowledgements\nPantheon is a project developed by the Macro Connections group at the Massachusetts Institute of Technology Media Lab. For more on the dataset and to see visualizations using it, visit its landing page on the MIT website.\nInspiration\nWhich historical figures have a biography in the most languages? Who received the most Wikipedia page views? Which occupations or industries are the most popular? What country has the most individuals with a historical popularity index over twenty?",
    "description_version": "1",
    "file_id": "22102528",
    "format": "arff",
    "id": "43703",
    "language": "English",
    "licence": "CC BY-SA 4.0",
    "md5_checksum": "f260b819d343abaf5638be27efa9ab57",
    "minio_url": "https://data.openml.org/datasets/0004/43703/dataset_43703.pq",
    "name": "Pantheon-Project-Historical-Popularity-Index",
    "parquet_url": "https://data.openml.org/datasets/0004/43703/dataset_43703.pq",
    "processing_date": "2022-03-24 07:16:48",
    "status": "active",
    "tag": "Kaggle",
    "upload_date": "2022-03-24T07:16:30",
    "url": "https://api.openml.org/data/v1/download/22102528/Pantheon-Project-Historical-Popularity-Index.arff",
    "version": "1",
    "version_label": "v1.0",
    "visibility": "public"
  }
}