{
  "data_set_description": {
    "collection_date": "10-12-2019",
    "description": "Context\nAfter the release of Pokmon Sword and Shield on the November 15, 2019, 81 new Pokemons were released alongside 13 regional variants of preexisting Pokmon.\nContent\nLike dataset from previous generations, you'll find data about:\n\nName \nHP\nAttack     \nDefense     \nSp. Attack     \nSp. Defense     \nSpeed     \nTotal     \nAverage\nGeneration\n\nAcknowledgements\nAlberto Barradas for all the Pokemons until generation 6 and gurarako for the generation 7.\nAdditional information gathered thanks to bulbapedia.",
    "description_version": "1",
    "file_id": "22102517",
    "format": "arff",
    "id": "43692",
    "language": "English",
    "licence": "CC0: Public Domain",
    "md5_checksum": "a9a63519343e00c20214c19a21d63f89",
    "minio_url": "https://data.openml.org/datasets/0004/43692/dataset_43692.pq",
    "name": "Pokemon-with-stats-Generation-8",
    "parquet_url": "https://data.openml.org/datasets/0004/43692/dataset_43692.pq",
    "processing_date": "2022-03-24 07:14:12",
    "status": "active",
    "upload_date": "2022-03-24T07:14:06",
    "url": "https://api.openml.org/data/v1/download/22102517/Pokemon-with-stats-Generation-8.arff",
    "version": "1",
    "version_label": "v1.0",
    "visibility": "public"
  }
}