{
  "data_set_description": {
    "collection_date": "03-03-2021",
    "description": "COVID-19 Stats  Trends\nContext\nThis dataset seeks to provide insights into what has changed due to policies aimed at combating COVID-19 and evaluate the changes in community activities and its relation to reduced confirmed cases of COVID-19. The reports chart movement trends, compared to an expected baseline, over time (from 2020/02/15 to 2020/02/05) by geography (across 133 countries), as well as some other stats about the country that might help explain the evolution of the disease.\nContent\n\nGrocery  Pharmacy: Mobility trends for places like grocery markets, food warehouses, farmers' markets, specialty food shops, drug stores, and pharmacies.\nParks: Mobility trends for places like national parks, public beaches, marinas, dog parks, plazas, and public gardens.\nResidential: Mobility trends for places of residence.\nRetail  Recreation: Mobility trends for places like restaurants, cafes, shopping centers, theme parks, museums, libraries, and movie theaters.\nTransit stations: Mobility trends for places like public transport hubs such as subway, bus, and train stations.\nWorkplaces: Mobility trends for places of work.\nTotal Cases: Total number of people infected with the SARS-CoV-2.\nFatalities: Total number of deaths caused by CoV-19.\nGovernment Response Stringency Index: Additive score of nine indicators of government response to CoV-19: School closures, workplace closures, cancellation of public events, public information campaigns, stay at home policies, restrictions on internal movement, international travel controls, testing policy, and contact tracing.\nCOVID-19 Testing: Total number of tests performed.\nTotal Vaccinations: Total number of shots given. \nTotal People Vaccinated: Total number of people given a shot.\nTotal People Fully Vaccinated: Total number of people fully vaccinated (might require two shots of some vaccines).\nPopulation: Total number of inhabitants.\nPopulation Density per km2: Number of human inhabitants per square kilometer.\nHealth System Index: Overall performance of the health system.\nHuman Development Index (HDI): Summary index based on life expectancy at birth, expected years of schooling for children and mean years of schooling for adults, and GNI per capita.\nGDP (PPP) per capita: Gross Domestic Product (GDP) per capita based on Purchasing Power Parity (PPP), taking into account the relative cost of local goods, services and inflation rates of the country, rather than using international market exchange rates, which may distort the real differences in per capita income.\nElderly Population (percentage): Percentage of the population above the age of 65 years old.\n\nReferences  Acknowledgements\nBing COVID-19 data. Available at: https://github.com/microsoft/Bing-COVID-19-Data\nCOVID-19 Community Mobility Report. Available at: https://www.google.com/covid19/mobility/\nCOVID-19: Government Response Stringency Index. Available at: https://ourworldindata.org/grapher/covid-stringency-index\nCoronavirus (COVID-19) Testing. Available at: https://github.com/owid/covid-19-data/blob/master/public/data/testing/covid-testing-all-observations.csv\nCoronavirus (COVID-19) Vaccination. Available at: https://raw.githubusercontent.com/owid/covid-19-data/master/public/data/vaccinations/vaccinations.csv\nList of countries and dependencies by population. Available at: https://www.kaggle.com/tanuprabhu/population-by-country-2020\nList of countries and dependencies by population density. Available at: https://www.kaggle.com/tanuprabhu/population-by-country-2020\nList of countries by Human Development Index. Available at: http://hdr.undp.org/en/data\nMeasuring Overall Health System Performance. Available at: https://www.who.int/healthinfo/paper30.pdf?ua=1\nList of countries by GDP (PPP) per capita. Available at: https://data.worldbank.org/indicator/NY.GDP.PCAP.PP.CD\nList of countries by age structure (65+). Available at: https://data.worldbank.org/indicator/SP.POP.65UP.TO.ZS\nAuthors\n\nDiogo Silva, up201706892fe.up.pt",
    "description_version": "1",
    "file_id": "22102509",
    "format": "arff",
    "id": "43684",
    "language": "English",
    "licence": "CC0: Public Domain",
    "md5_checksum": "751c4fe37d8529b3607b972556d58e5b",
    "minio_url": "https://data.openml.org/datasets/0004/43684/dataset_43684.pq",
    "name": "COVID-19-Stats-and-Mobility-Trends",
    "parquet_url": "https://data.openml.org/datasets/0004/43684/dataset_43684.pq",
    "processing_date": "2022-03-24 07:13:09",
    "status": "active",
    "upload_date": "2022-03-24T07:12:23",
    "url": "https://api.openml.org/data/v1/download/22102509/COVID-19-Stats-and-Mobility-Trends.arff",
    "version": "1",
    "version_label": "v1.0",
    "visibility": "public"
  }
}