{
  "data_set_description": {
    "collection_date": "08-02-2021",
    "description": "Context\nThis dataset was prepared for the journal article entitled \"On the prediction of critical heat flux using a physics-informed machine learning-aided framework\" (doi: 10.1016/j.applthermaleng.2019.114540). The dataset contains processed and compiled records of experimental critical heat flux and boundary conditions used for the work presented in the article. \nAcknowledgements\nZhao, Xingang (2020), Data for: On the prediction of critical heat flux using a physics-informed machine learning-aided framework, Mendeley Data, V1, doi: 10.17632/5p5h37tyv7.1",
    "description_version": "1",
    "file_id": "22102496",
    "format": "arff",
    "id": "43671",
    "ignore_attribute": "id",
    "language": "English",
    "licence": "Attribution 4.0 International (CC BY 4.0)",
    "md5_checksum": "903e643f31a11c99e4703c00c054567b",
    "minio_url": "https://data.openml.org/datasets/0004/43671/dataset_43671.pq",
    "name": "Predicting-Critical-Heat-Flux",
    "parquet_url": "https://data.openml.org/datasets/0004/43671/dataset_43671.pq",
    "processing_date": "2022-03-24 01:21:51",
    "status": "active",
    "upload_date": "2022-03-24T01:21:13",
    "url": "https://api.openml.org/data/v1/download/22102496/Predicting-Critical-Heat-Flux.arff",
    "version": "1",
    "version_label": "v1.0",
    "visibility": "public"
  }
}