{
  "data_set_description": {
    "collection_date": "20-09-2020",
    "description": "Context\nThis is a complete set of Player Data from eFootball PES 2021 video game , the latest of the football franchise by KONAMI. It can be useful for generating insights about trends of skills and ratings , as well as comparisons between Leagues and regions.\nWhat's most intriguing is the \"scouting\" mechanism in the game ; gazillions of agent combinations , leading to different probabilities of acquiring a player , changing by who you already have your squad as well",
    "description_version": "1",
    "file_id": "22102474",
    "format": "arff",
    "id": "43649",
    "language": "English",
    "licence": "GPL 2",
    "md5_checksum": "f198416b0cb9e74fa3cdbbd46d059734",
    "minio_url": "https://data.openml.org/datasets/0004/43649/dataset_43649.pq",
    "name": "efootball-pes2021-all-players-csv",
    "parquet_url": "https://data.openml.org/datasets/0004/43649/dataset_43649.pq",
    "processing_date": "2022-03-24 00:59:04",
    "status": "active",
    "upload_date": "2022-03-24T00:58:48",
    "url": "https://api.openml.org/data/v1/download/22102474/efootball-pes2021-all-players-csv.arff",
    "version": "1",
    "version_label": "v1.0",
    "visibility": "public"
  }
}