{
  "data_set_description": {
    "collection_date": "14-07-2020",
    "description": "Context\nThis Data set Contains the values of Stock of Amazon which dates between 1st October,2019 to 14 July,2020\nContent\nThe Data set contains 7 different columns that includes Date, The opening value of the stock, the closing value of stock, volume and a few other things necessary to make predictions.\nAcknowledgements\nThis data was scraped from Yahoo finance and you can also use their API to access the data.",
    "description_version": "1",
    "file_id": "22102464",
    "format": "arff",
    "id": "43639",
    "language": "English",
    "licence": "CC0: Public Domain",
    "md5_checksum": "e7245151d46ca28cd8e6bfe2bdfb76fe",
    "minio_url": "https://data.openml.org/datasets/0004/43639/dataset_43639.pq",
    "name": "Amazon-Stock-Data(Oct-2019---July-2020)LATEST",
    "parquet_url": "https://data.openml.org/datasets/0004/43639/dataset_43639.pq",
    "processing_date": "2022-03-24 00:56:10",
    "status": "active",
    "upload_date": "2022-03-24T00:55:38",
    "url": "https://api.openml.org/data/v1/download/22102464/Amazon-Stock-Data(Oct-2019---July-2020)LATEST.arff",
    "version": "1",
    "version_label": "v1.0",
    "visibility": "public"
  }
}