{
  "data_set_description": {
    "collection_date": "19-08-2020",
    "description": "Context\nFacebook is a company that literally every kid is aware of. Its a household name. People from various age groups are there on this social media website. It has helped many in connecting with different people and also has helped some of the investors by earning them a good amount of money. This data set contains the details of the stock of Facebook Inc.\nContent\nThis data set has 7 columns with all the necessary values such as opening price of the stock, the closing price of it, its highest in the day and much more. It has date wise data of the stock starting from 2012 to 2020(August).",
    "description_version": "1",
    "file_id": "22102461",
    "format": "arff",
    "id": "43636",
    "language": "English",
    "licence": "CC0: Public Domain",
    "md5_checksum": "b2460bdc1eb23a5ee26593805de909ce",
    "minio_url": "https://data.openml.org/datasets/0004/43636/dataset_43636.pq",
    "name": "Facebook-Complete-Stock-Data2012---2020Latest",
    "parquet_url": "https://data.openml.org/datasets/0004/43636/dataset_43636.pq",
    "processing_date": "2022-03-24 00:56:08",
    "status": "active",
    "upload_date": "2022-03-24T00:55:14",
    "url": "https://api.openml.org/data/v1/download/22102461/Facebook-Complete-Stock-Data2012---2020Latest.arff",
    "version": "1",
    "version_label": "v1.0",
    "visibility": "public"
  }
}