{
  "data_set_description": {
    "collection_date": "10-01-2021",
    "description": "Context\nModels of human cognition hold that information processing occurs in a series of stages. Cognitive psychology, in particular, is concerned with the internal mental processes that begin with the appearance of an external stimulus and result in a behavioural response.\nContent\nExplore human cognitive processes around the generation of narrativeswith a focus on the language employed in stories about events that have been experienced versus imagined. Investigate and characterize cognitive processes involved in storytelling, contrasting imagination and recollection of events with the help of Data Science.\nBuild a machine learning model that would help you to categorize cognitive processes involved in storytelling - Imagined, Recalledor Retold.\nThese are the columns in the data:\n\nAssignmentId: Unique ID of this story\nWorkTimeInSeconds: Time in seconds that it took the worker to do the entire HIT (reading instructions, story writing, questions)\nWorkerId: Unique ID of the worker (random string, not MTurk worker ID)\nannotatorAge: Lower limit of the age bucket of the worker. Buckets are: 18-24, 25-29, 30-34, 35-39, 40-44, 45-49, 50-54, 55+\nannotatorGender: Gender of the worker\nannotatorRace: Race/ethnicity of the worker\ndistracted: How distracted were you while writing your story? (5-point Likert)\ndraining: How taxing/draining was writing for you emotionally? (5-point Likert)\nfrequency: How often do you think about or talk about this event? (5-point Likert)\nimportance: How impactful, important, or personal is this story/event to you? (5-point Likert)\nlogTimeSinceEvent: Log of time (days) since the recalled event happened\nmainEvent: Short phrase describing the main event described\nmemType: Type of story (recalled, imagined, retold) - The target variable\nmostSurprising: Short phrase describing what the most surprising aspect of the story was\nopenness: Continuous variable representing the openness to experience of the worker\nrecAgnPairId: ID of the recalled story that corresponds to this retold story (null for imagined stories). Group on this variable to get the recalled-retold pairs.\nrecImgPairId: ID of the recalled story that corresponds to this imagined story (null for retold stories). Group on this variable to get the recalled-imagined pairs.\nsimilarity: How similar to your life does this event/story feel to you? (5-point Likert)\nsimilarityReason: Free text annotation of similarity\nstory: Story about the imagined or recalled event (15-25 sentences)\nstressful: How stressful was this writing task? (5-point Likert)\nsummary: Summary of the events in the story (1-3 sentences)\ntimeSinceEvent: Time (number of days) since the recalled event happened\n\nLikert scaling is a bipolar scaling method, measuring either positive or negative response to a statement.\nAcknowledgements\nMaarten Sap, Eric Horvitz, Yejin Choi, Noah A. Smith, and James Pennebaker (2020) Recollection versus Imagination: Exploring Human Memory and Cognition via Neural Language Models. ACL.\nInspiration\nExplore the human cognitive process using machine learning.",
    "description_version": "1",
    "file_id": "22102421",
    "format": "arff",
    "id": "43596",
    "language": "English",
    "licence": "CC0: Public Domain",
    "md5_checksum": "e284e7048a5ea960319c69aa4db73c5b",
    "minio_url": "https://data.openml.org/datasets/0004/43596/dataset_43596.pq",
    "name": "Human-Memory-and-Cognition",
    "parquet_url": "https://data.openml.org/datasets/0004/43596/dataset_43596.pq",
    "processing_date": "2022-03-24 00:34:05",
    "status": "active",
    "upload_date": "2022-03-24T00:33:17",
    "url": "https://api.openml.org/data/v1/download/22102421/Human-Memory-and-Cognition.arff",
    "version": "1",
    "version_label": "v1.0",
    "visibility": "public"
  }
}