{
  "data_features": {
    "feature": [
      {
        "data_type": "numeric",
        "index": "0",
        "is_ignore": "false",
        "is_row_identifier": "false",
        "is_target": "false",
        "name": "Unnamed:_0",
        "number_of_missing_values": "0"
      },
      {
        "data_type": "string",
        "index": "1",
        "is_ignore": "false",
        "is_row_identifier": "false",
        "is_target": "false",
        "name": "date",
        "number_of_missing_values": "0"
      },
      {
        "data_type": "string",
        "index": "2",
        "is_ignore": "false",
        "is_row_identifier": "false",
        "is_target": "false",
        "name": "time",
        "number_of_missing_values": "1798"
      },
      {
        "data_type": "numeric",
        "index": "3",
        "is_ignore": "false",
        "is_row_identifier": "false",
        "is_target": "false",
        "name": "season",
        "number_of_missing_values": "0"
      },
      {
        "data_type": "numeric",
        "index": "4",
        "is_ignore": "false",
        "is_row_identifier": "false",
        "is_target": "false",
        "name": "game_id",
        "number_of_missing_values": "732"
      },
      {
        "data_type": "string",
        "index": "5",
        "is_ignore": "false",
        "is_row_identifier": "false",
        "is_target": "false",
        "name": "sr_start",
        "number_of_missing_values": "1625"
      },
      {
        "data_type": "string",
        "index": "6",
        "is_ignore": "false",
        "is_row_identifier": "false",
        "is_target": "false",
        "name": "sr_finish",
        "number_of_missing_values": "1627"
      },
      {
        "data_type": "string",
        "index": "7",
        "is_ignore": "false",
        "is_row_identifier": "false",
        "is_target": "false",
        "name": "sr_delta",
        "number_of_missing_values": "1627"
      },
      {
        "data_type": "string",
        "index": "8",
        "is_ignore": "false",
        "is_row_identifier": "false",
        "is_target": "false",
        "name": "streak_number",
        "number_of_missing_values": "1045"
      },
      {
        "data_type": "string",
        "index": "9",
        "is_ignore": "false",
        "is_row_identifier": "false",
        "is_target": "false",
        "name": "result",
        "number_of_missing_values": "33"
      },
      {
        "data_type": "string",
        "index": "10",
        "is_ignore": "false",
        "is_row_identifier": "false",
        "is_target": "false",
        "name": "my_team_sr",
        "number_of_missing_values": "44"
      },
      {
        "data_type": "string",
        "index": "11",
        "is_ignore": "false",
        "is_row_identifier": "false",
        "is_target": "false",
        "name": "enemy_team_sr",
        "number_of_missing_values": "44"
      },
      {
        "data_type": "string",
        "index": "12",
        "is_ignore": "false",
        "is_row_identifier": "false",
        "is_target": "false",
        "name": "team_sr_delta",
        "number_of_missing_values": "48"
      },
      {
        "data_type": "string",
        "index": "13",
        "is_ignore": "false",
        "is_row_identifier": "false",
        "is_target": "false",
        "name": "my_team_1",
        "number_of_missing_values": "4"
      },
      {
        "data_type": "string",
        "index": "14",
        "is_ignore": "false",
        "is_row_identifier": "false",
        "is_target": "false",
        "name": "my_team_2",
        "number_of_missing_values": "10"
      },
      {
        "data_type": "string",
        "index": "15",
        "is_ignore": "false",
        "is_row_identifier": "false",
        "is_target": "false",
        "name": "my_team_3",
        "number_of_missing_values": "14"
      },
      {
        "data_type": "string",
        "index": "16",
        "is_ignore": "false",
        "is_row_identifier": "false",
        "is_target": "false",
        "name": "my_team_4",
        "number_of_missing_values": "12"
      },
      {
        "data_type": "string",
        "index": "17",
        "is_ignore": "false",
        "is_row_identifier": "false",
        "is_target": "false",
        "name": "my_team_5",
        "number_of_missing_values": "16"
      },
      {
        "data_type": "string",
        "index": "18",
        "is_ignore": "false",
        "is_row_identifier": "false",
        "is_target": "false",
        "name": "my_team_6",
        "number_of_missing_values": "14"
      },
      {
        "data_type": "string",
        "index": "19",
        "is_ignore": "false",
        "is_row_identifier": "false",
        "is_target": "false",
        "name": "enemy_team_1",
        "number_of_missing_values": "30"
      },
      {
        "data_type": "string",
        "index": "20",
        "is_ignore": "false",
        "is_row_identifier": "false",
        "is_target": "false",
        "name": "enemy_team_2",
        "number_of_missing_values": "26"
      },
      {
        "data_type": "string",
        "index": "21",
        "is_ignore": "false",
        "is_row_identifier": "false",
        "is_target": "false",
        "name": "enemy_team_3",
        "number_of_missing_values": "25"
      },
      {
        "data_type": "string",
        "index": "22",
        "is_ignore": "false",
        "is_row_identifier": "false",
        "is_target": "false",
        "name": "enemy_team_4",
        "number_of_missing_values": "28"
      },
      {
        "data_type": "string",
        "index": "23",
        "is_ignore": "false",
        "is_row_identifier": "false",
        "is_target": "false",
        "name": "enemy_team_5",
        "number_of_missing_values": "25"
      },
      {
        "data_type": "string",
        "index": "24",
        "is_ignore": "false",
        "is_row_identifier": "false",
        "is_target": "false",
        "name": "enemy_team_6",
        "number_of_missing_values": "27"
      },
      {
        "data_type": "string",
        "index": "25",
        "is_ignore": "false",
        "is_row_identifier": "false",
        "is_target": "false",
        "name": "map",
        "number_of_missing_values": "5"
      },
      {
        "data_type": "string",
        "index": "26",
        "is_ignore": "false",
        "is_row_identifier": "false",
        "is_target": "false",
        "name": "round",
        "number_of_missing_values": "6"
      },
      {
        "data_type": "string",
        "index": "27",
        "is_ignore": "false",
        "is_row_identifier": "false",
        "is_target": "false",
        "name": "capscore",
        "number_of_missing_values": "23"
      },
      {
        "data_type": "string",
        "index": "28",
        "is_ignore": "false",
        "is_row_identifier": "false",
        "is_target": "false",
        "name": "score_distance",
        "number_of_missing_values": "1517"
      },
      {
        "data_type": "string",
        "index": "29",
        "is_ignore": "false",
        "is_row_identifier": "false",
        "is_target": "false",
        "name": "time_left",
        "number_of_missing_values": "518"
      },
      {
        "data_type": "string",
        "index": "30",
        "is_ignore": "false",
        "is_row_identifier": "false",
        "is_target": "false",
        "name": "team_role",
        "number_of_missing_values": "24"
      },
      {
        "data_type": "string",
        "index": "31",
        "is_ignore": "false",
        "is_row_identifier": "false",
        "is_target": "false",
        "name": "match_length",
        "number_of_missing_values": "107"
      },
      {
        "data_type": "string",
        "index": "32",
        "is_ignore": "false",
        "is_row_identifier": "false",
        "is_target": "false",
        "name": "charcter_1",
        "number_of_missing_values": "156"
      },
      {
        "data_type": "string",
        "index": "33",
        "is_ignore": "false",
        "is_row_identifier": "false",
        "is_target": "false",
        "name": "character_2",
        "number_of_missing_values": "2810"
      },
      {
        "data_type": "string",
        "index": "34",
        "is_ignore": "false",
        "is_row_identifier": "false",
        "is_target": "false",
        "name": "character_3",
        "number_of_missing_values": "3244"
      },
      {
        "data_type": "string",
        "index": "35",
        "is_ignore": "false",
        "is_row_identifier": "false",
        "is_target": "false",
        "name": "communication",
        "number_of_missing_values": "1999"
      },
      {
        "data_type": "string",
        "index": "36",
        "is_ignore": "false",
        "is_row_identifier": "false",
        "is_target": "false",
        "name": "note",
        "number_of_missing_values": "2801"
      },
      {
        "data_type": "string",
        "index": "37",
        "is_ignore": "false",
        "is_row_identifier": "false",
        "is_target": "false",
        "name": "psychological_condition",
        "number_of_missing_values": "9"
      },
      {
        "data_type": "string",
        "index": "38",
        "is_ignore": "false",
        "is_row_identifier": "false",
        "is_target": "false",
        "name": "eliminations",
        "number_of_missing_values": "3027"
      },
      {
        "data_type": "numeric",
        "index": "39",
        "is_ignore": "false",
        "is_row_identifier": "false",
        "is_target": "false",
        "name": "objective_kills",
        "number_of_missing_values": "3028"
      },
      {
        "data_type": "string",
        "index": "40",
        "is_ignore": "false",
        "is_row_identifier": "false",
        "is_target": "false",
        "name": "damage",
        "number_of_missing_values": "3028"
      },
      {
        "data_type": "numeric",
        "index": "41",
        "is_ignore": "false",
        "is_row_identifier": "false",
        "is_target": "false",
        "name": "healing",
        "number_of_missing_values": "3030"
      },
      {
        "data_type": "numeric",
        "index": "42",
        "is_ignore": "false",
        "is_row_identifier": "false",
        "is_target": "false",
        "name": "deaths",
        "number_of_missing_values": "3030"
      },
      {
        "data_type": "numeric",
        "index": "43",
        "is_ignore": "false",
        "is_row_identifier": "false",
        "is_target": "false",
        "name": "weapon_accuracy",
        "number_of_missing_values": "3034"
      },
      {
        "data_type": "numeric",
        "index": "44",
        "is_ignore": "false",
        "is_row_identifier": "false",
        "is_target": "false",
        "name": "offensive_assists",
        "number_of_missing_values": "3150"
      },
      {
        "data_type": "numeric",
        "index": "45",
        "is_ignore": "false",
        "is_row_identifier": "false",
        "is_target": "false",
        "name": "defensive_assists",
        "number_of_missing_values": "3190"
      },
      {
        "data_type": "numeric",
        "index": "46",
        "is_ignore": "false",
        "is_row_identifier": "false",
        "is_target": "false",
        "name": "scoped",
        "number_of_missing_values": "3143"
      }
    ]
  }
}