{
  "data_set_description": {
    "collection_date": "17-10-2019",
    "description": "Context\nJapanese animation, which is known as anime, has become internationally widespread nowadays. This dataset provides data on anime taken from Anime News Network. \nContent\nThis dataset consists of 1563 anime data, with the following columns:\n\nTitle\nType\nnumber of episodes\netc\n\nAcknowledgements\nThe dataset was collected from http://www.myanimelist.net\nInspiration\nThis dataset can be used to build recommendation systems, predict a score, visualize anime similarity, etc.",
    "description_version": "1",
    "file_id": "22102333",
    "format": "arff",
    "id": "43508",
    "language": "English",
    "licence": "CC BY-NC-SA 4.0",
    "md5_checksum": "a7e6e5fe4a0cec579394282ba43f6a82",
    "minio_url": "https://data.openml.org/datasets/0004/43508/dataset_43508.pq",
    "name": "Anime-Data",
    "parquet_url": "https://data.openml.org/datasets/0004/43508/dataset_43508.pq",
    "processing_date": "2022-03-23 13:33:40",
    "status": "active",
    "upload_date": "2022-03-23T13:31:23",
    "url": "https://api.openml.org/data/v1/download/22102333/Anime-Data.arff",
    "version": "1",
    "version_label": "v1.0",
    "visibility": "public"
  }
}