{
  "data_set_description": {
    "collection_date": "01-02-2020",
    "description": "Content\nThis data is an extract from a bigger reddit dataset (All reddit comments from May 2019, 157Gb or data uncompressed) that contains both more comments and more associated informations (timestamps, author, flairs etc).\nFor ease of use, I picked the first 25 000  comments for each of the 40 most frequented subreddits  (May 2019), this was if anyone wants to us the subreddit as categorical data, the volumes are balanced.\nI also excluded any removed comments / comments whose author got deleted and comments deemed too short (less than 4 tokens) and changed the format (json - csv).\nThis is primarily a NLP dataset, but in addition to the comments I added the 3 features I deemed the most important, I also aimed for feature type variety.\nThe information kept here is:\n\nsubreddit (categorical): on which subreddit the comment was posted\nbody (str): comment content\ncontroversiality (binary): a reddit aggregated metric\nscore (scalar): upvotes minus downvotes\n\nAcknowledgements\nThe data is but a small extract of what is being collected by pushshift.io on a monthly basis. You easily find the full information if you want to work with more features and more data.\nWhat can I do with that?\nHave fun! The variety of feature types should allow you to gain a few interesting insights or build some simple models.\nNote\nIf you think the License (CC0: Public Domain) should be different, contact me",
    "description_version": "1",
    "file_id": "22102329",
    "format": "arff",
    "id": "43504",
    "language": "English",
    "licence": "CC0: Public Domain",
    "md5_checksum": "2797c88747a0e9697b4a628cb481d8d3",
    "minio_url": "https://data.openml.org/datasets/0004/43504/dataset_43504.pq",
    "name": "1-million-Reddit-comments-from-40-subreddits",
    "parquet_url": "https://data.openml.org/datasets/0004/43504/dataset_43504.pq",
    "processing_date": "2022-03-23 13:38:45",
    "status": "active",
    "upload_date": "2022-03-23T13:31:10",
    "url": "https://api.openml.org/data/v1/download/22102329/1-million-Reddit-comments-from-40-subreddits.arff",
    "version": "1",
    "version_label": "v1.0",
    "visibility": "public"
  }
}