{
  "data_set_description": {
    "collection_date": "30-08-2018",
    "description": "P2P Lending\nI concatenated historical loans from both Prosper and Lending Club 2013 - 2018.  Currently only the summary of the loan (terms, origination date, loan amount, status, etc) are up but detailed lender data will come soon.  The columns are matched up as accurately as possible but there are estimated columns, see below for more info.\nContent\nTo come.",
    "description_version": "1",
    "file_id": "22102327",
    "format": "arff",
    "id": "43502",
    "language": "English",
    "licence": "CC BY-SA 4.0",
    "md5_checksum": "337400ce30447878860ee5e2db1b060a",
    "minio_url": "https://data.openml.org/datasets/0004/43502/dataset_43502.pq",
    "name": "Online-P2P-Lending",
    "parquet_url": "https://data.openml.org/datasets/0004/43502/dataset_43502.pq",
    "processing_date": "2022-03-23 13:35:38",
    "status": "active",
    "upload_date": "2022-03-23T13:31:04",
    "url": "https://api.openml.org/data/v1/download/22102327/Online-P2P-Lending.arff",
    "version": "1",
    "version_label": "v1.0",
    "visibility": "public"
  }
}