{
  "data_set_description": {
    "collection_date": "17-07-2020",
    "description": "This data set contains demographic, geographic, and severity information for all confirmed and probable cases reported to and managed by Toronto Public Health since the first case was reported in January 2020. This includes cases that are sporadic (occurring in the community) and outbreak-associated. The data are extracted from the provincial communicable disease reporting system (iPHIS) and Toronto's custom COVID-19 case management system (CORES) and combined for reporting.\nThe data in this spreadsheet are subject to change as public health investigations into reported cases and continuous quality improvement initiatives are ongoing, and additional cases continue to be reported.",
    "description_version": "1",
    "file_id": "22102305",
    "format": "arff",
    "id": "43480",
    "language": "English",
    "licence": "CC0: Public Domain",
    "md5_checksum": "4d7b15ee360bacdd4b02bb77eb832890",
    "minio_url": "https://data.openml.org/datasets/0004/43480/dataset_43480.pq",
    "name": "Toronto-COVID-19-Cases",
    "parquet_url": "https://data.openml.org/datasets/0004/43480/dataset_43480.pq",
    "processing_date": "2022-03-23 13:29:29",
    "status": "active",
    "upload_date": "2022-03-23T13:26:35",
    "url": "https://api.openml.org/data/v1/download/22102305/Toronto-COVID-19-Cases.arff",
    "version": "1",
    "version_label": "v1.0",
    "visibility": "public"
  }
}