{
  "data_qualities": {
    "quality": [
      {
        "name": "AutoCorrelation",
        "value": []
      },
      {
        "name": "Dimensionality",
        "value": "0.0136"
      },
      {
        "name": "MajorityClassPercentage",
        "value": []
      },
      {
        "name": "MajorityClassSize",
        "value": []
      },
      {
        "name": "MinorityClassPercentage",
        "value": []
      },
      {
        "name": "MinorityClassSize",
        "value": []
      },
      {
        "name": "NumberOfBinaryFeatures",
        "value": "0.0"
      },
      {
        "name": "NumberOfClasses",
        "value": []
      },
      {
        "name": "NumberOfFeatures",
        "value": "68.0"
      },
      {
        "name": "NumberOfInstances",
        "value": "5000.0"
      },
      {
        "name": "NumberOfInstancesWithMissingValues",
        "value": "5000.0"
      },
      {
        "name": "NumberOfMissingValues",
        "value": "129439.0"
      },
      {
        "name": "NumberOfNumericFeatures",
        "value": "24.0"
      },
      {
        "name": "NumberOfSymbolicFeatures",
        "value": "0.0"
      },
      {
        "name": "PercentageOfBinaryFeatures",
        "value": "0.0"
      },
      {
        "name": "PercentageOfInstancesWithMissingValues",
        "value": "100.0"
      },
      {
        "name": "PercentageOfMissingValues",
        "value": "38.07029411764706"
      },
      {
        "name": "PercentageOfNumericFeatures",
        "value": "35.294117647058826"
      },
      {
        "name": "PercentageOfSymbolicFeatures",
        "value": "0.0"
      }
    ]
  }
}