{
  "data_set_description": {
    "collection_date": "16-04-2020",
    "default_target_attribute": "bad_client_target",
    "description": "Context\nImbalanced classes put accuracy out of business. This is a surprisingly common problem in machine learning (specifically in classification), occurring in datasets with a disproportionate ratio of observations in each class.\nContent\nStandard accuracy no longer reliably measures performance, which makes model training much trickier.\nImbalanced classes appear in many domains, including:\n\nAntifraud\nAntispam\n\n\nInspiration\n5 tactics for handling imbalanced classes in machine learning:\n\nUp-sample the minority class\nDown-sample the majority class\nChange your performance metric\nPenalize algorithms (cost-sensitive training)\nUse tree-based algorithms",
    "description_version": "1",
    "file_id": "22102267",
    "format": "arff",
    "id": "43442",
    "language": "English",
    "licence": "CC0: Public Domain",
    "md5_checksum": "d1de713dc0276cf1fba1bc8c0b5cecef",
    "minio_url": "https://data.openml.org/datasets/0004/43442/dataset_43442.pq",
    "name": "Is-this-a-good-customer",
    "parquet_url": "https://data.openml.org/datasets/0004/43442/dataset_43442.pq",
    "processing_date": "2022-03-23 13:25:08",
    "status": "active",
    "upload_date": "2022-03-23T13:21:19",
    "url": "https://api.openml.org/data/v1/download/22102267/Is-this-a-good-customer.arff",
    "version": "1",
    "version_label": "v1.0",
    "visibility": "public"
  }
}