{
  "data_features": {
    "feature": [
      {
        "data_type": "numeric",
        "index": "0",
        "is_ignore": "false",
        "is_row_identifier": "false",
        "is_target": "false",
        "name": "id",
        "number_of_missing_values": "0"
      },
      {
        "data_type": "string",
        "index": "1",
        "is_ignore": "false",
        "is_row_identifier": "false",
        "is_target": "false",
        "name": "title",
        "number_of_missing_values": "224"
      },
      {
        "data_type": "string",
        "index": "2",
        "is_ignore": "false",
        "is_row_identifier": "false",
        "is_target": "false",
        "name": "link",
        "number_of_missing_values": "0"
      },
      {
        "data_type": "string",
        "index": "3",
        "is_ignore": "false",
        "is_row_identifier": "false",
        "is_target": "false",
        "name": "series",
        "number_of_missing_values": "28880"
      },
      {
        "data_type": "string",
        "index": "4",
        "is_ignore": "false",
        "is_row_identifier": "false",
        "is_target": "false",
        "name": "cover_link",
        "number_of_missing_values": "607"
      },
      {
        "data_type": "string",
        "index": "5",
        "is_ignore": "false",
        "is_row_identifier": "false",
        "is_target": "false",
        "name": "author",
        "number_of_missing_values": "6"
      },
      {
        "data_type": "string",
        "index": "6",
        "is_ignore": "false",
        "is_row_identifier": "false",
        "is_target": "false",
        "name": "author_link",
        "number_of_missing_values": "0"
      },
      {
        "data_type": "numeric",
        "index": "7",
        "is_ignore": "false",
        "is_row_identifier": "false",
        "is_target": "false",
        "name": "rating_count",
        "number_of_missing_values": "0"
      },
      {
        "data_type": "numeric",
        "index": "8",
        "is_ignore": "false",
        "is_row_identifier": "false",
        "is_target": "false",
        "name": "review_count",
        "number_of_missing_values": "0"
      },
      {
        "data_type": "numeric",
        "index": "9",
        "is_ignore": "false",
        "is_row_identifier": "false",
        "is_target": "false",
        "name": "average_rating",
        "number_of_missing_values": "0"
      },
      {
        "data_type": "numeric",
        "index": "10",
        "is_ignore": "false",
        "is_row_identifier": "false",
        "is_target": "false",
        "name": "five_star_ratings",
        "number_of_missing_values": "0"
      },
      {
        "data_type": "numeric",
        "index": "11",
        "is_ignore": "false",
        "is_row_identifier": "false",
        "is_target": "false",
        "name": "four_star_ratings",
        "number_of_missing_values": "0"
      },
      {
        "data_type": "numeric",
        "index": "12",
        "is_ignore": "false",
        "is_row_identifier": "false",
        "is_target": "false",
        "name": "three_star_ratings",
        "number_of_missing_values": "0"
      },
      {
        "data_type": "numeric",
        "index": "13",
        "is_ignore": "false",
        "is_row_identifier": "false",
        "is_target": "false",
        "name": "two_star_ratings",
        "number_of_missing_values": "0"
      },
      {
        "data_type": "numeric",
        "index": "14",
        "is_ignore": "false",
        "is_row_identifier": "false",
        "is_target": "false",
        "name": "one_star_ratings",
        "number_of_missing_values": "0"
      },
      {
        "data_type": "numeric",
        "index": "15",
        "is_ignore": "false",
        "is_row_identifier": "false",
        "is_target": "false",
        "name": "number_of_pages",
        "number_of_missing_values": "2330"
      },
      {
        "data_type": "string",
        "index": "16",
        "is_ignore": "false",
        "is_row_identifier": "false",
        "is_target": "false",
        "name": "date_published",
        "number_of_missing_values": "860"
      },
      {
        "data_type": "string",
        "index": "17",
        "is_ignore": "false",
        "is_row_identifier": "false",
        "is_target": "false",
        "name": "publisher",
        "number_of_missing_values": "3935"
      },
      {
        "data_type": "string",
        "index": "18",
        "is_ignore": "false",
        "is_row_identifier": "false",
        "is_target": "false",
        "name": "original_title",
        "number_of_missing_values": "13266"
      },
      {
        "data_type": "string",
        "index": "19",
        "is_ignore": "false",
        "is_row_identifier": "false",
        "is_target": "false",
        "name": "genre_and_votes",
        "number_of_missing_values": "2840"
      },
      {
        "data_type": "string",
        "index": "20",
        "is_ignore": "false",
        "is_row_identifier": "false",
        "is_target": "false",
        "name": "isbn",
        "number_of_missing_values": "11883"
      },
      {
        "data_type": "string",
        "index": "21",
        "is_ignore": "false",
        "is_row_identifier": "false",
        "is_target": "false",
        "name": "isbn13",
        "number_of_missing_values": "12692"
      },
      {
        "data_type": "string",
        "index": "22",
        "is_ignore": "false",
        "is_row_identifier": "false",
        "is_target": "false",
        "name": "asin",
        "number_of_missing_values": "46963"
      },
      {
        "data_type": "string",
        "index": "23",
        "is_ignore": "false",
        "is_row_identifier": "false",
        "is_target": "false",
        "name": "settings",
        "number_of_missing_values": "40687"
      },
      {
        "data_type": "string",
        "index": "24",
        "is_ignore": "false",
        "is_row_identifier": "false",
        "is_target": "false",
        "name": "characters",
        "number_of_missing_values": "38509"
      },
      {
        "data_type": "string",
        "index": "25",
        "is_ignore": "false",
        "is_row_identifier": "false",
        "is_target": "false",
        "name": "awards",
        "number_of_missing_values": "41574"
      },
      {
        "data_type": "string",
        "index": "26",
        "is_ignore": "false",
        "is_row_identifier": "false",
        "is_target": "false",
        "name": "amazon_redirect_link",
        "number_of_missing_values": "0"
      },
      {
        "data_type": "string",
        "index": "27",
        "is_ignore": "false",
        "is_row_identifier": "false",
        "is_target": "false",
        "name": "worldcat_redirect_link",
        "number_of_missing_values": "3985"
      },
      {
        "data_type": "string",
        "index": "28",
        "is_ignore": "false",
        "is_row_identifier": "false",
        "is_target": "false",
        "name": "recommended_books",
        "number_of_missing_values": "3994"
      },
      {
        "data_type": "string",
        "index": "29",
        "is_ignore": "false",
        "is_row_identifier": "false",
        "is_target": "false",
        "name": "books_in_series",
        "number_of_missing_values": "30121"
      },
      {
        "data_type": "string",
        "index": "30",
        "is_ignore": "false",
        "is_row_identifier": "false",
        "is_target": "false",
        "name": "description",
        "number_of_missing_values": "2595"
      }
    ]
  }
}