{
  "data_features": {
    "feature": [
      {
        "data_type": "string",
        "index": "0",
        "is_ignore": "false",
        "is_row_identifier": "false",
        "is_target": "false",
        "name": "datetime",
        "number_of_missing_values": "0"
      },
      {
        "data_type": "string",
        "index": "1",
        "is_ignore": "false",
        "is_row_identifier": "false",
        "is_target": "false",
        "name": "title",
        "number_of_missing_values": "0"
      },
      {
        "data_type": "string",
        "index": "2",
        "is_ignore": "false",
        "is_row_identifier": "false",
        "is_target": "false",
        "name": "content",
        "number_of_missing_values": "0"
      },
      {
        "data_type": "string",
        "index": "3",
        "is_ignore": "false",
        "is_row_identifier": "false",
        "is_target": "false",
        "name": "category",
        "number_of_missing_values": "0"
      },
      {
        "data_type": "string",
        "index": "4",
        "is_ignore": "false",
        "is_row_identifier": "false",
        "is_target": "false",
        "name": "url",
        "number_of_missing_values": "0"
      }
    ]
  }
}