{
  "data_set_description": {
    "collection_date": "11-12-2019",
    "description": "Context\nTraffic data collected from the several Wavetronix radar sensors deployed by the City of Austin. Dataset is augmented with geo coordinates from sensor location dataset.\nSource: https://data.austintexas.gov/\nContent\nWhat's inside is more than just rows and columns. Make it easy for others to get started by describing how you acquired the data and what time period it represents, too.\nAcknowledgements\nData Source: https://data.austintexas.gov/\nPhoto by Jeremy Banks on Unsplash\nInspiration\nYour data will be in front of the world's largest data science community. What questions do you want to see answered?",
    "description_version": "1",
    "file_id": "22102179",
    "format": "arff",
    "id": "43354",
    "language": "English",
    "licence": "CC0: Public Domain",
    "md5_checksum": "7dc5686c08b4ae5d205bffd5086d1c35",
    "minio_url": "https://data.openml.org/datasets/0004/43354/dataset_43354.pq",
    "name": "Radar-Traffic-Data",
    "parquet_url": "https://data.openml.org/datasets/0004/43354/dataset_43354.pq",
    "processing_date": "2022-03-23 12:37:01",
    "status": "active",
    "upload_date": "2022-03-23T12:35:19",
    "url": "https://api.openml.org/data/v1/download/22102179/Radar-Traffic-Data.arff",
    "version": "1",
    "version_label": "v1.0",
    "visibility": "public"
  }
}