{
  "data_qualities": {
    "quality": [
      {
        "name": "AutoCorrelation",
        "value": []
      },
      {
        "name": "Dimensionality",
        "value": "0.020348837209302327"
      },
      {
        "name": "MajorityClassPercentage",
        "value": []
      },
      {
        "name": "MajorityClassSize",
        "value": []
      },
      {
        "name": "MinorityClassPercentage",
        "value": []
      },
      {
        "name": "MinorityClassSize",
        "value": []
      },
      {
        "name": "NumberOfBinaryFeatures",
        "value": "0.0"
      },
      {
        "name": "NumberOfClasses",
        "value": []
      },
      {
        "name": "NumberOfFeatures",
        "value": "7.0"
      },
      {
        "name": "NumberOfInstances",
        "value": "344.0"
      },
      {
        "name": "NumberOfInstancesWithMissingValues",
        "value": "11.0"
      },
      {
        "name": "NumberOfMissingValues",
        "value": "19.0"
      },
      {
        "name": "NumberOfNumericFeatures",
        "value": "4.0"
      },
      {
        "name": "NumberOfSymbolicFeatures",
        "value": "0.0"
      },
      {
        "name": "PercentageOfBinaryFeatures",
        "value": "0.0"
      },
      {
        "name": "PercentageOfInstancesWithMissingValues",
        "value": "3.1976744186046515"
      },
      {
        "name": "PercentageOfMissingValues",
        "value": "0.7890365448504983"
      },
      {
        "name": "PercentageOfNumericFeatures",
        "value": "57.14285714285714"
      },
      {
        "name": "PercentageOfSymbolicFeatures",
        "value": "0.0"
      }
    ]
  }
}