{
  "data_qualities": {
    "quality": [
      {
        "name": "AutoCorrelation",
        "value": []
      },
      {
        "name": "Dimensionality",
        "value": "0.0024639878695981803"
      },
      {
        "name": "MajorityClassPercentage",
        "value": []
      },
      {
        "name": "MajorityClassSize",
        "value": []
      },
      {
        "name": "MinorityClassPercentage",
        "value": []
      },
      {
        "name": "MinorityClassSize",
        "value": []
      },
      {
        "name": "NumberOfBinaryFeatures",
        "value": "0.0"
      },
      {
        "name": "NumberOfClasses",
        "value": []
      },
      {
        "name": "NumberOfFeatures",
        "value": "26.0"
      },
      {
        "name": "NumberOfInstances",
        "value": "10552.0"
      },
      {
        "name": "NumberOfInstancesWithMissingValues",
        "value": "10406.0"
      },
      {
        "name": "NumberOfMissingValues",
        "value": "49282.0"
      },
      {
        "name": "NumberOfNumericFeatures",
        "value": "13.0"
      },
      {
        "name": "NumberOfSymbolicFeatures",
        "value": "0.0"
      },
      {
        "name": "PercentageOfBinaryFeatures",
        "value": "0.0"
      },
      {
        "name": "PercentageOfInstancesWithMissingValues",
        "value": "98.61637604245641"
      },
      {
        "name": "PercentageOfMissingValues",
        "value": "17.963054761765907"
      },
      {
        "name": "PercentageOfNumericFeatures",
        "value": "50.0"
      },
      {
        "name": "PercentageOfSymbolicFeatures",
        "value": "0.0"
      }
    ]
  }
}