{
  "data_set_description": {
    "description": "//Add the description.md of the data file pair0001\n\nInformation for pairs0001:\n\nDWD data (Deutscher Wetterdienst)\n\ndata was taken at 349 stations\n\ntaken from\n//*http://www.dwd.de/bvbw/appmanager/bvbw/dwdwwwDesktop/?_nfpb=true&_pageLabel=_dwdwww_klima_umwelt_klimadat//en_deutschland&T82002gsbDocumentPath=Navigation%2FOeffentlichkeit%2FKlima__Umwelt%2FKlimadaten%2Fkldaten__//kostenfrei%2Fausgabe__mittelwerte__node.html__nnn%3Dtrue*\n\nmore recent  link (Jan 2010):\n\n//*http://www.dwd.de/bvbw/appmanager/bvbw/dwdwwwDesktop/?_nfpb=true&_pageLabel=_dwdwww_klima_umwelt_klimadat//en_deutschland&T82002gsbDocumentPath=Navigation%2FOeffentlichkeit%2FKlima__Umwelt%2FKlimadaten%2Fkldaten__//kostenfrei%2Fausgabe__mittelwerte__node.html__nnn%3Dtrue*\n\n\nx: altitude\n\ny: temperature (average over 1961-1990)",
    "description_version": "1",
    "file_id": "22102054",
    "format": "arff",
    "id": "43279",
    "licence": "Public",
    "md5_checksum": "6623aef2cf1a342976252dda150007aa",
    "minio_url": "http://openml1.win.tue.nl/dataset43279/dataset_43279.pq",
    "name": "pair0001",
    "processing_date": "2022-03-15 22:04:12",
    "status": "active",
    "upload_date": "2022-03-15T22:03:18",
    "url": "https://www.openml.org/data/v1/download/22102054/pair0001.arff",
    "version": "1",
    "visibility": "public"
  }
}