"date","quarter","department","day","team","targeted_productivity","smv","wip","over_time","incentive","idle_time","idle_men","no_of_style_change","no_of_workers","actual_productivity"
1/1/2015,Quarter1,sweing,Thursday,8,0.8,26.16,1108,7080,98,0,0,0,59,0.940725
1/1/2015,Quarter1,'finishing ',Thursday,1,0.75,3.94,?,960,0,0,0,0,8,0.8865
1/1/2015,Quarter1,sweing,Thursday,11,0.8,11.41,968,3660,50,0,0,0,30.5,0.80057
1/1/2015,Quarter1,sweing,Thursday,12,0.8,11.41,968,3660,50,0,0,0,30.5,0.80057
1/1/2015,Quarter1,sweing,Thursday,6,0.8,25.9,1170,1920,50,0,0,0,56,0.800382
1/1/2015,Quarter1,sweing,Thursday,7,0.8,25.9,984,6720,38,0,0,0,56,0.800125
1/1/2015,Quarter1,'finishing ',Thursday,2,0.75,3.94,?,960,0,0,0,0,8,0.755167
1/1/2015,Quarter1,sweing,Thursday,3,0.75,28.08,795,6900,45,0,0,0,57.5,0.753683
1/1/2015,Quarter1,sweing,Thursday,2,0.75,19.87,733,6000,34,0,0,0,55,0.753098
1/1/2015,Quarter1,sweing,Thursday,1,0.75,28.08,681,6900,45,0,0,0,57.5,0.750428
1/1/2015,Quarter1,sweing,Thursday,9,0.7,28.08,872,6900,44,0,0,0,57.5,0.721127
1/1/2015,Quarter1,sweing,Thursday,10,0.75,19.31,578,6480,45,0,0,0,54,0.712205
1/1/2015,Quarter1,sweing,Thursday,5,0.8,11.41,668,3660,50,0,0,0,30.5,0.707046
1/1/2015,Quarter1,'finishing ',Thursday,10,0.65,3.94,?,960,0,0,0,0,8,0.705917
1/1/2015,Quarter1,'finishing ',Thursday,8,0.75,2.9,?,960,0,0,0,0,8,0.676667
1/1/2015,Quarter1,'finishing ',Thursday,4,0.75,3.94,?,2160,0,0,0,0,18,0.593056
1/1/2015,Quarter1,'finishing ',Thursday,7,0.8,2.9,?,960,0,0,0,0,8,0.540729
1/1/2015,Quarter1,sweing,Thursday,4,0.65,23.69,861,7200,0,0,0,0,60,0.52118
1/1/2015,Quarter1,finishing,Thursday,11,0.7,4.15,?,1440,0,0,0,0,12,0.436326
1/3/2015,Quarter1,'finishing ',Saturday,4,0.8,4.15,?,6600,0,0,0,0,20,0.988025
1/3/2015,Quarter1,'finishing ',Saturday,11,0.75,2.9,?,5640,0,0,0,0,17,0.98788
1/3/2015,Quarter1,'finishing ',Saturday,9,0.8,4.15,?,960,0,0,0,0,8,0.956271
1/3/2015,Quarter1,'finishing ',Saturday,3,0.75,3.94,?,1560,0,0,0,0,8,0.945278
1/3/2015,Quarter1,'finishing ',Saturday,1,0.8,3.94,?,960,0,0,0,0,8,0.902917
1/3/2015,Quarter1,sweing,Saturday,1,0.8,28.08,772,6300,50,0,0,0,56.5,0.800725
1/3/2015,Quarter1,sweing,Saturday,3,0.8,28.08,913,6540,50,0,0,0,54.5,0.800323
1/3/2015,Quarter1,sweing,Saturday,8,0.8,26.16,1261,7080,50,0,0,0,59,0.800319
1/3/2015,Quarter1,sweing,Saturday,12,0.8,26.16,844,7080,63,0,0,0,59,0.800319
1/3/2015,Quarter1,sweing,Saturday,11,0.8,11.61,1005,7080,50,0,0,0,29.5,0.800237
1/3/2015,Quarter1,sweing,Saturday,5,0.8,11.61,659,7080,50,0,0,0,31.5,0.800149
1/3/2015,Quarter1,sweing,Saturday,6,0.8,25.9,1152,6720,50,0,0,0,56,0.800125
1/3/2015,Quarter1,sweing,Saturday,7,0.8,25.9,1138,6720,38,0,0,0,56,0.800125
1/3/2015,Quarter1,sweing,Saturday,10,0.75,19.31,610,6480,56,0,0,0,54,0.7873
1/3/2015,Quarter1,'finishing ',Saturday,2,0.8,4.15,?,960,0,0,0,0,8,0.782448
1/3/2015,Quarter1,sweing,Saturday,2,0.75,19.87,944,6600,45,0,0,0,55,0.750243
1/3/2015,Quarter1,'finishing ',Saturday,10,0.7,4.15,?,960,0,0,0,0,8,0.701812
1/3/2015,Quarter1,sweing,Saturday,4,0.7,23.69,544,13800,0,0,0,0,60,0.700134
1/3/2015,Quarter1,sweing,Saturday,9,0.7,28.08,1072,6900,40,0,0,0,57.5,0.699965
1/3/2015,Quarter1,'finishing ',Saturday,8,0.8,2.9,?,960,0,0,0,0,8,0.628333
1/3/2015,Quarter1,'finishing ',Saturday,7,0.8,3.94,?,960,0,0,0,0,8,0.625313
1/4/2015,Quarter1,'finishing ',Sunday,3,0.75,4.15,?,1560,0,0,0,0,8,0.991389
1/4/2015,Quarter1,'finishing ',Sunday,9,0.8,3.94,?,960,0,0,0,0,8,0.931646
1/4/2015,Quarter1,'finishing ',Sunday,1,0.8,3.94,?,960,0,0,0,0,8,0.915229
1/4/2015,Quarter1,sweing,Sunday,6,0.8,11.61,539,6975,50,0,0,0,31,0.879714
1/4/2015,Quarter1,'finishing ',Sunday,4,0.8,3.94,?,6600,0,0,0,0,20,0.861679
1/4/2015,Quarter1,sweing,Sunday,9,0.8,26.16,1278,7080,60,0,0,0,59,0.850569
1/4/2015,Quarter1,sweing,Sunday,7,0.8,25.9,1227,7020,60,0,0,0,56.5,0.850436
1/4/2015,Quarter1,sweing,Sunday,8,0.8,25.9,1039,6780,45,0,0,0,56.5,0.850345
1/4/2015,Quarter1,sweing,Sunday,4,0.8,28.08,878,4260,50,0,0,0,55.5,0.800598
1/4/2015,Quarter1,sweing,Sunday,1,0.8,26.16,1033,7080,63,0,0,0,59,0.800319
1/4/2015,Quarter1,sweing,Sunday,2,0.8,28.08,782,6660,50,0,0,0,55.5,0.800238
1/4/2015,Quarter1,sweing,Sunday,12,0.8,11.61,1216,6975,50,0,0,0,31,0.80003
1/4/2015,Quarter1,'finishing ',Sunday,2,0.8,3.94,?,960,0,0,0,0,8,0.792104
1/4/2015,Quarter1,'finishing ',Sunday,10,0.7,3.94,?,4320,0,0,0,0,18,0.759228
1/4/2015,Quarter1,sweing,Sunday,11,0.75,19.31,513,6480,45,0,0,0,54,0.750348
1/4/2015,Quarter1,sweing,Sunday,3,0.75,19.87,734,6600,45,0,0,0,55,0.750243
1/4/2015,Quarter1,sweing,Sunday,10,0.7,28.08,1202,6900,40,0,0,0,57.5,0.699965
1/4/2015,Quarter1,'finishing ',Sunday,8,0.8,2.9,?,960,0,0,0,0,8,0.682708
1/4/2015,Quarter1,'finishing ',Sunday,7,0.8,2.9,?,960,0,0,0,0,8,0.667604
1/4/2015,Quarter1,sweing,Sunday,5,0.7,45.67,884,6960,26,0,0,0,58,0.603432
1/4/2015,Quarter1,'finishing ',Sunday,11,0.75,4.15,?,960,0,0,0,0,8,0.345833
1/5/2015,Quarter1,'finishing ',Monday,1,0.8,3.94,?,1920,0,0,0,0,8,0.961059
1/5/2015,Quarter1,'finishing ',Monday,11,0.8,3.94,?,2400,0,0,0,0,10,0.939514
1/5/2015,Quarter1,'finishing ',Monday,4,0.8,3.94,?,3840,0,0,0,0,16,0.893663
1/5/2015,Quarter1,'finishing ',Monday,3,0.75,4.15,?,1920,0,0,0,0,8,0.875391
1/5/2015,Quarter1,sweing,Monday,9,0.8,26.16,1227,7080,75,0,0,0,59,0.850569
1/5/2015,Quarter1,'finishing ',Monday,9,0.8,2.9,?,1920,0,0,0,0,8,0.820833
1/5/2015,Quarter1,'finishing ',Monday,2,0.8,3.94,?,960,0,0,0,0,8,0.804417
1/5/2015,Quarter1,sweing,Monday,7,0.8,25.9,1255,6780,50,0,0,0,56.5,0.800684
1/5/2015,Quarter1,sweing,Monday,8,0.8,25.9,1047,6780,38,0,0,0,56.5,0.800684
1/5/2015,Quarter1,sweing,Monday,1,0.8,26.16,1138,7080,63,0,0,0,59,0.800319
1/5/2015,Quarter1,sweing,Monday,11,0.8,19.31,678,4800,50,0,0,0,55,0.800251
1/5/2015,Quarter1,sweing,Monday,6,0.8,11.61,712,7200,50,0,0,0,32,0.800246
1/5/2015,Quarter1,sweing,Monday,12,0.8,11.61,1037,7200,50,0,0,0,32,0.800246
1/5/2015,Quarter1,sweing,Monday,2,0.8,28.08,757,6900,50,0,0,0,57.5,0.800077
1/5/2015,Quarter1,sweing,Monday,4,0.8,28.08,759,6900,50,0,0,0,57.5,0.800077
1/5/2015,Quarter1,'finishing ',Monday,10,0.75,2.9,?,960,0,0,0,0,8,0.763375
1/5/2015,Quarter1,'finishing ',Monday,5,0.6,2.9,?,960,0,0,0,0,8,0.759271
1/5/2015,Quarter1,sweing,Monday,10,0.75,28.08,1083,7020,45,0,0,0,58.5,0.7504
1/5/2015,Quarter1,sweing,Monday,3,0.75,19.87,944,6600,45,0,0,0,55,0.750243
1/5/2015,Quarter1,'finishing ',Monday,7,0.8,3.94,?,960,0,0,0,0,8,0.676667
1/5/2015,Quarter1,'finishing ',Monday,8,0.8,2.9,?,960,0,0,0,0,8,0.664583
1/5/2015,Quarter1,sweing,Monday,5,0.6,21.98,666,6960,23,0,0,0,58,0.600029
1/6/2015,Quarter1,'finishing ',Tuesday,4,0.8,3.94,?,4440,0,0,0,0,18,0.966781
1/6/2015,Quarter1,'finishing ',Tuesday,1,0.8,3.94,?,1440,0,0,0,0,8,0.936496
1/6/2015,Quarter1,'finishing ',Tuesday,3,0.75,4.15,?,1800,0,0,0,0,10,0.899167
1/6/2015,Quarter1,'finishing ',Tuesday,11,0.8,4.15,?,2700,0,0,0,0,15,0.888687
1/6/2015,Quarter1,'finishing ',Tuesday,9,0.8,3.94,?,1440,0,0,0,0,8,0.858144
1/6/2015,Quarter1,sweing,Tuesday,1,0.8,26.16,1187,10620,75,0,0,0,59,0.850502
1/6/2015,Quarter1,sweing,Tuesday,9,0.8,26.16,1305,10620,75,0,0,0,59,0.850502
1/6/2015,Quarter1,'finishing ',Tuesday,10,0.75,3.94,?,1440,0,0,0,0,8,0.80964
1/6/2015,Quarter1,'finishing ',Tuesday,2,0.8,3.94,?,1440,0,0,0,0,8,0.805909
1/6/2015,Quarter1,sweing,Tuesday,2,0.8,28.08,716,10350,50,0,0,0,57.5,0.800594
1/6/2015,Quarter1,sweing,Tuesday,4,0.8,28.08,925,10350,50,0,0,0,57.5,0.800594
1/6/2015,Quarter1,sweing,Tuesday,3,0.8,19.87,963,9900,50,0,0,0,55,0.800274
1/6/2015,Quarter1,sweing,Tuesday,12,0.8,11.61,1101,5310,50,0,0,0,31.5,0.800141
1/6/2015,Quarter1,sweing,Tuesday,7,0.8,25.9,1035,10170,38,0,0,0,56.5,0.800129
1/6/2015,Quarter1,sweing,Tuesday,8,0.8,25.9,1083,10170,38,0,0,0,56.5,0.800129
1/6/2015,Quarter1,sweing,Tuesday,6,0.8,11.61,910,4470,38,0,0,0,31.5,0.800077
1/6/2015,Quarter1,sweing,Tuesday,10,0.75,28.08,1209,10530,45,0,0,0,58.5,0.750545
1/6/2015,Quarter1,sweing,Tuesday,11,0.75,19.31,590,9900,45,0,0,0,55,0.750058
1/6/2015,Quarter1,'finishing ',Tuesday,8,0.8,2.9,?,1440,0,0,0,0,8,0.681061
1/6/2015,Quarter1,sweing,Tuesday,5,0.65,21.98,808,10440,35,0,0,0,58,0.649983
1/6/2015,Quarter1,'finishing ',Tuesday,7,0.8,2.9,?,1440,0,0,0,0,8,0.61625
1/7/2015,Quarter1,'finishing ',Wednesday,1,0.8,3.94,?,1440,0,0,0,0,8,0.95142
1/7/2015,Quarter1,'finishing ',Wednesday,9,0.8,3.94,?,1440,0,0,0,0,8,0.88053
1/7/2015,Quarter1,sweing,Wednesday,1,0.8,26.16,1179,10620,75,0,0,0,59,0.850502
1/7/2015,Quarter1,sweing,Wednesday,9,0.8,26.16,1324,10620,75,0,0,0,59,0.850502
1/7/2015,Quarter1,sweing,Wednesday,8,0.8,25.9,1135,10170,60,0,0,0,56.5,0.850137
1/7/2015,Quarter1,'finishing ',Wednesday,3,0.75,4.15,?,2700,0,0,0,0,15,0.83
1/7/2015,Quarter1,'finishing ',Wednesday,4,0.8,3.94,?,4440,0,0,0,0,18,0.827187
1/7/2015,Quarter1,'finishing ',Wednesday,2,0.8,3.94,?,1440,0,0,0,0,8,0.813371
1/7/2015,Quarter1,'finishing ',Wednesday,10,0.75,3.94,?,1440,0,0,0,0,8,0.805909
1/7/2015,Quarter1,'finishing ',Wednesday,7,0.8,2.9,?,1440,0,0,0,0,8,0.80464
1/7/2015,Quarter1,sweing,Wednesday,2,0.8,28.08,776,10350,63,0,0,0,57.5,0.800594
1/7/2015,Quarter1,sweing,Wednesday,4,0.8,28.08,990,10350,50,0,0,0,57.5,0.800594
1/7/2015,Quarter1,sweing,Wednesday,6,0.8,11.41,986,5490,50,0,0,0,30.5,0.800344
1/7/2015,Quarter1,sweing,Wednesday,3,0.8,19.87,924,9900,50,0,0,0,55,0.800274
1/7/2015,Quarter1,sweing,Wednesday,12,0.8,11.61,1120,5670,50,0,0,0,31.5,0.800247
1/7/2015,Quarter1,sweing,Wednesday,7,0.8,25.9,1066,10170,50,0,0,0,56.5,0.800129
1/7/2015,Quarter1,sweing,Wednesday,10,0.75,28.08,1144,10530,69,0,0,0,58.5,0.8
1/7/2015,Quarter1,sweing,Wednesday,5,0.7,21.98,413,9720,40,0,0,0,58,0.700481
1/7/2015,Quarter1,'finishing ',Wednesday,8,0.8,2.9,?,1440,0,0,0,0,8,0.681061
1/7/2015,Quarter1,'finishing ',Wednesday,6,0.8,2.9,?,1800,0,0,0,0,10,0.666515
1/7/2015,Quarter1,sweing,Wednesday,11,0.8,31.83,568,9900,40,0,0,0,55,0.41212
1/7/2015,Quarter1,'finishing ',Wednesday,5,0.7,4.15,?,1440,0,0,0,0,8,0.330114
1/8/2015,Quarter2,'finishing ',Thursday,1,0.8,3.94,?,1440,0,0,0,0,8,0.947689
1/8/2015,Quarter2,'finishing ',Thursday,4,0.8,3.94,?,12600,0,0,0,0,20,0.919905
1/8/2015,Quarter2,sweing,Thursday,9,0.8,26.16,1216,10620,88,0,0,0,59,0.900216
1/8/2015,Quarter2,'finishing ',Thursday,9,0.8,3.94,?,1440,0,0,0,0,8,0.891723
1/8/2015,Quarter2,sweing,Thursday,1,0.8,26.16,1189,10620,75,0,0,0,59,0.850502
1/8/2015,Quarter2,sweing,Thursday,4,0.8,28.08,942,10530,75,0,0,0,58.5,0.850182
1/8/2015,Quarter2,sweing,Thursday,7,0.8,25.9,1050,10170,60,0,0,0,56.5,0.850137
1/8/2015,Quarter2,sweing,Thursday,8,0.8,25.9,1026,10170,60,0,0,0,56.5,0.850137
1/8/2015,Quarter2,'finishing ',Thursday,2,0.8,3.94,?,1440,0,0,0,0,8,0.835758
1/8/2015,Quarter2,'finishing ',Thursday,5,0.7,4.15,?,3840,0,0,0,0,8,0.821354
1/8/2015,Quarter2,sweing,Thursday,2,0.8,28.08,783,10050,63,0,0,0,58.5,0.800497
1/8/2015,Quarter2,sweing,Thursday,3,0.8,19.87,857,9900,50,0,0,0,55,0.800274
1/8/2015,Quarter2,sweing,Thursday,12,0.8,11.61,548,15120,63,0,0,0,31.5,0.800107
1/8/2015,Quarter2,sweing,Thursday,6,0.8,11.41,411,14640,50,0,0,0,30.5,0.800025
1/8/2015,Quarter2,sweing,Thursday,10,0.75,28.08,1066,10530,69,0,0,0,58.5,0.8
1/8/2015,Quarter2,'finishing ',Thursday,10,0.75,3.94,?,1440,0,0,0,0,8,0.779792
1/8/2015,Quarter2,'finishing ',Thursday,8,0.8,2.9,?,1440,0,0,0,0,8,0.735985
1/8/2015,Quarter2,'finishing ',Thursday,3,0.75,4.15,?,2160,0,0,0,0,12,0.712626
1/8/2015,Quarter2,'finishing ',Thursday,7,0.8,2.9,?,1440,0,0,0,0,8,0.681061
1/8/2015,Quarter2,'finishing ',Thursday,11,0.8,4.15,?,900,0,0,0,0,5,0.515606
1/8/2015,Quarter2,sweing,Thursday,11,0.35,12.52,287,25920,38,0,0,0,54,0.349951
1/8/2015,Quarter2,sweing,Thursday,5,0.7,42.41,724,10260,0,0,0,0,57,0.233705
1/10/2015,Quarter2,'finishing ',Saturday,1,0.8,3.94,?,2160,0,0,0,0,8,0.985
1/10/2015,Quarter2,'finishing ',Saturday,3,0.75,4.15,?,2760,0,0,0,0,12,0.93034
1/10/2015,Quarter2,'finishing ',Saturday,4,0.8,3.94,?,6000,0,0,0,0,20,0.91159
1/10/2015,Quarter2,'finishing ',Saturday,9,0.8,3.94,?,1440,0,0,0,0,8,0.858144
1/10/2015,Quarter2,sweing,Saturday,9,0.8,26.16,1122,10620,75,0,0,0,59,0.851174
1/10/2015,Quarter2,sweing,Saturday,7,0.8,25.9,970,10170,60,0,0,0,56.5,0.850137
1/10/2015,Quarter2,sweing,Saturday,8,0.8,25.9,1158,10170,60,0,0,0,56.5,0.850137
1/10/2015,Quarter2,'finishing ',Saturday,10,0.8,3.94,?,1440,0,0,0,0,8,0.846951
1/10/2015,Quarter2,'finishing ',Saturday,11,0.8,4.15,?,1440,0,0,0,0,8,0.817424
1/10/2015,Quarter2,'finishing ',Saturday,2,0.8,3.94,?,1440,0,0,0,0,8,0.817102
1/10/2015,Quarter2,sweing,Saturday,4,0.8,28.08,660,10440,63,0,0,0,58,0.801028
1/10/2015,Quarter2,sweing,Saturday,2,0.8,28.08,749,10350,63,0,0,0,57.5,0.800594
1/10/2015,Quarter2,sweing,Saturday,12,0.8,11.61,893,4710,50,0,0,0,31.5,0.800346
1/10/2015,Quarter2,sweing,Saturday,6,0.8,11.41,887,5490,50,0,0,0,30.5,0.800344
1/10/2015,Quarter2,sweing,Saturday,1,0.8,26.16,1335,10620,63,0,0,0,59,0.800117
1/10/2015,Quarter2,sweing,Saturday,10,0.8,28.08,1082,10530,63,0,0,0,58.5,0.8
1/10/2015,Quarter2,sweing,Saturday,3,0.75,19.87,1075,7080,45,0,0,0,56,0.750098
1/10/2015,Quarter2,sweing,Saturday,11,0.5,12.52,749,9540,38,0,0,0,53,0.673245
1/10/2015,Quarter2,'finishing ',Saturday,7,0.8,2.9,?,1440,0,0,0,0,8,0.670076
1/10/2015,Quarter2,'finishing ',Saturday,8,0.8,2.9,?,1440,0,0,0,0,8,0.628883
1/10/2015,Quarter2,sweing,Saturday,5,0.5,20.79,966,7680,0,0,0,0,56,0.388008
1/10/2015,Quarter2,'finishing ',Saturday,5,0.5,4.15,?,1440,0,0,0,0,8,0.337973
1/11/2015,Quarter2,'finishing ',Sunday,3,0.75,4.15,?,1440,0,0,0,0,8,0.935322
1/11/2015,Quarter2,'finishing ',Sunday,4,0.8,3.94,?,3600,0,0,0,0,20,0.925644
1/11/2015,Quarter2,sweing,Sunday,9,0.8,26.16,1095,10620,88,0,0,0,59,0.900216
1/11/2015,Quarter2,'finishing ',Sunday,1,0.8,3.94,?,1440,0,0,0,0,8,0.873068
1/11/2015,Quarter2,'finishing ',Sunday,9,0.8,3.94,?,1440,0,0,0,0,8,0.858144
1/11/2015,Quarter2,sweing,Sunday,1,0.8,26.16,1383,10620,75,0,0,0,59,0.850502
1/11/2015,Quarter2,sweing,Sunday,7,0.8,25.9,1012,10170,45,0,0,0,56.5,0.850137
1/11/2015,Quarter2,sweing,Sunday,8,0.8,25.9,1209,10170,60,0,0,0,56.5,0.850137
1/11/2015,Quarter2,'finishing ',Sunday,10,0.8,3.94,?,1440,0,0,0,0,8,0.828295
1/11/2015,Quarter2,'finishing ',Sunday,2,0.8,3.94,?,1440,0,0,0,0,8,0.820833
1/11/2015,Quarter2,sweing,Sunday,6,0.8,11.41,887,5490,50,0,0,0,30.5,0.800344
1/11/2015,Quarter2,sweing,Sunday,12,0.8,11.61,896,5670,50,0,0,0,31.5,0.800247
1/11/2015,Quarter2,sweing,Sunday,2,0.8,28.08,805,10530,63,0,0,0,58.5,0.8
1/11/2015,Quarter2,sweing,Sunday,10,0.8,28.08,762,10530,38,0,0,0,58.5,0.8
1/11/2015,Quarter2,sweing,Sunday,3,0.8,19.87,1043,6420,0,0,0,0,55,0.690183
1/11/2015,Quarter2,'finishing ',Sunday,11,0.8,4.15,?,1440,0,0,0,0,8,0.668087
1/11/2015,Quarter2,'finishing ',Sunday,8,0.8,2.9,?,1440,0,0,0,0,8,0.653598
1/11/2015,Quarter2,'finishing ',Sunday,5,0.5,4.15,?,1440,0,0,0,0,8,0.609138
1/11/2015,Quarter2,sweing,Sunday,11,0.6,12.52,831,9540,30,0,0,0,53,0.60023
1/11/2015,Quarter2,'finishing ',Sunday,6,0.8,2.9,?,1440,0,0,0,0,8,0.597348
1/11/2015,Quarter2,'finishing ',Sunday,7,0.8,2.9,?,1440,0,0,0,0,8,0.590436
1/11/2015,Quarter2,sweing,Sunday,4,0.8,50.48,562,10440,0,0,0,0,58,0.473135
1/11/2015,Quarter2,sweing,Sunday,5,0.6,20.79,1208,7980,0,0,0,0,57,0.45298
1/12/2015,Quarter2,'finishing ',Monday,1,0.8,3.94,?,1440,0,0,0,0,8,0.955152
1/12/2015,Quarter2,'finishing ',Monday,4,0.35,4.3,?,3240,0,0,0,0,18,0.942214
1/12/2015,Quarter2,'finishing ',Monday,3,0.8,4.15,?,1800,0,0,0,0,10,0.905455
1/12/2015,Quarter2,'finishing ',Monday,2,0.8,3.94,?,1440,0,0,0,0,8,0.88053
1/12/2015,Quarter2,'finishing ',Monday,9,0.8,3.94,?,1440,0,0,0,0,8,0.858144
1/12/2015,Quarter2,sweing,Monday,1,0.8,26.16,1099,8220,75,0,0,0,59,0.850522
1/12/2015,Quarter2,sweing,Monday,9,0.8,26.16,1093,10620,75,0,0,0,59,0.850502
1/12/2015,Quarter2,sweing,Monday,7,0.8,25.9,1031,10170,60,0,0,0,56.5,0.850137
1/12/2015,Quarter2,sweing,Monday,8,0.8,25.9,1233,10170,60,0,0,0,56.5,0.850137
1/12/2015,Quarter2,'finishing ',Monday,6,0.8,2.9,?,1440,0,0,0,0,8,0.817424
1/12/2015,Quarter2,'finishing ',Monday,5,0.65,4.15,?,1440,0,0,0,0,8,0.809564
1/12/2015,Quarter2,sweing,Monday,3,0.8,19.87,941,9900,0,0,0,0,55,0.800274
1/12/2015,Quarter2,sweing,Monday,6,0.8,11.41,843,5670,50,0,0,0,31.5,0.800182
1/12/2015,Quarter2,sweing,Monday,12,0.8,11.61,760,4470,50,0,0,0,31.5,0.800077
1/12/2015,Quarter2,sweing,Monday,2,0.8,28.08,737,10530,63,0,0,0,58.5,0.8
1/12/2015,Quarter2,'finishing ',Monday,8,0.8,2.9,?,1440,0,0,0,0,8,0.725
1/12/2015,Quarter2,sweing,Monday,10,0.8,50.48,381,6930,45,0,0,0,58.5,0.688558
1/12/2015,Quarter2,sweing,Monday,5,0.65,20.79,1141,8460,0,0,0,0,59,0.650041
1/12/2015,Quarter2,sweing,Monday,11,0.65,12.52,1004,9540,44,0,0,0,53,0.649981
1/12/2015,Quarter2,'finishing ',Monday,7,0.8,2.9,?,1440,0,0,0,0,8,0.648106
1/12/2015,Quarter2,'finishing ',Monday,11,0.8,4.15,?,1440,0,0,0,0,8,0.640578
1/12/2015,Quarter2,sweing,Monday,4,0.35,22.4,581,7350,0,0,0,0,51.5,0.350633
1/12/2015,Quarter2,'finishing ',Monday,10,0.8,3.94,?,1440,0,0,0,0,8,0.24625
1/13/2015,Quarter2,'finishing ',Tuesday,4,0.35,4.3,?,2160,0,0,0,0,12,0.95202
1/13/2015,Quarter2,'finishing ',Tuesday,1,0.8,3.94,?,1440,0,0,0,0,2,0.95142
1/13/2015,Quarter2,'finishing ',Tuesday,10,0.8,3.94,?,5400,0,0,0,0,20,0.912767
1/13/2015,Quarter2,'finishing ',Tuesday,3,0.8,4.15,?,1620,0,0,0,0,9,0.901263
1/13/2015,Quarter2,'finishing ',Tuesday,9,0.8,3.94,?,1440,0,0,0,0,8,0.858144
1/13/2015,Quarter2,sweing,Tuesday,1,0.8,26.16,1073,10620,75,0,0,0,59,0.850502
1/13/2015,Quarter2,sweing,Tuesday,9,0.8,26.16,1156,10620,75,0,0,0,59,0.850502
1/13/2015,Quarter2,sweing,Tuesday,8,0.8,25.9,1211,10260,60,0,0,0,57,0.850253
1/13/2015,Quarter2,sweing,Tuesday,7,0.8,25.9,1126,10170,60,0,0,0,56.5,0.850137
1/13/2015,Quarter2,'finishing ',Tuesday,5,0.65,4.15,?,1440,0,0,0,0,8,0.821354
1/13/2015,Quarter2,'finishing ',Tuesday,2,0.8,3.94,?,1440,0,0,0,0,8,0.805909
1/13/2015,Quarter2,sweing,Tuesday,6,0.8,11.61,1004,5670,50,0,0,0,31.5,0.800247
1/13/2015,Quarter2,sweing,Tuesday,12,0.8,11.61,1063,5670,50,0,0,0,31.5,0.800247
1/13/2015,Quarter2,sweing,Tuesday,2,0.8,28.08,723,10530,50,0,0,0,58.5,0.8
1/13/2015,Quarter2,sweing,Tuesday,3,0.8,42.27,465,9900,54,0,0,0,55,0.705577
1/13/2015,Quarter2,'finishing ',Tuesday,8,0.8,2.9,?,1440,0,0,0,0,8,0.681061
1/13/2015,Quarter2,'finishing ',Tuesday,7,0.8,2.9,?,1440,0,0,0,0,8,0.670076
1/13/2015,Quarter2,'finishing ',Tuesday,11,0.8,4.15,?,1440,0,0,0,0,8,0.601278
1/13/2015,Quarter2,sweing,Tuesday,11,0.7,27.13,530,9540,37,0,0,0,53,0.582301
1/13/2015,Quarter2,sweing,Tuesday,5,0.7,20.79,1297,10440,0,0,0,0,58,0.52681
1/13/2015,Quarter2,sweing,Tuesday,4,0.5,22.4,783,10170,23,0,0,0,56.5,0.500381
1/13/2015,Quarter2,sweing,Tuesday,10,0.35,22.4,715,10170,23,0,0,0,56.5,0.350206
1/14/2015,Quarter2,'finishing ',Wednesday,11,0.8,4.15,?,1980,0,0,0,0,7,0.934607
1/14/2015,Quarter2,'finishing ',Wednesday,4,0.35,4.3,?,2700,0,0,0,0,8,0.908081
1/14/2015,Quarter2,sweing,Wednesday,7,0.8,25.9,1150,10170,70,0,0,0,56.5,0.900145
1/14/2015,Quarter2,'finishing ',Wednesday,1,0.8,3.94,?,1440,0,0,0,0,8,0.891723
1/14/2015,Quarter2,'finishing ',Wednesday,5,0.65,4.15,?,1440,0,0,0,0,15,0.864583
1/14/2015,Quarter2,'finishing ',Wednesday,9,0.8,3.94,?,1440,0,0,0,0,8,0.858144
1/14/2015,Quarter2,sweing,Wednesday,9,0.8,26.16,1232,10620,75,0,0,0,59,0.850502
1/14/2015,Quarter2,sweing,Wednesday,8,0.8,25.9,1218,10170,60,0,0,0,56.5,0.850137
1/14/2015,Quarter2,'finishing ',Wednesday,7,0.8,2.9,?,1440,0,0,0,0,8,0.837595
1/14/2015,Quarter2,'finishing ',Wednesday,3,0.8,4.15,?,1440,0,0,0,0,7,0.820833
1/14/2015,Quarter2,sweing,Wednesday,12,0.8,11.61,1159,2970,50,0,0,0,31.5,0.800313
1/14/2015,Quarter2,sweing,Wednesday,6,0.8,11.61,972,5670,38,0,0,0,31.5,0.800247
1/14/2015,Quarter2,sweing,Wednesday,1,0.8,26.16,1092,10620,63,0,0,0,59,0.800117
1/14/2015,Quarter2,sweing,Wednesday,5,0.7,20.79,965,7320,0,0,0,0,58,0.700096
1/14/2015,Quarter2,'finishing ',Wednesday,8,0.8,2.9,?,1440,0,0,0,0,8,0.66733
1/14/2015,Quarter2,sweing,Wednesday,4,0.6,22.4,816,5100,23,0,0,0,57,0.60037
1/14/2015,Quarter2,sweing,Wednesday,10,0.5,22.4,947,3390,23,0,0,0,56.5,0.49998
1/14/2015,Quarter2,sweing,Wednesday,11,0.35,14.61,838,7200,23,0,0,0,55,0.350031
1/14/2015,Quarter2,'finishing ',Wednesday,10,0.8,3.94,?,1260,0,0,0,0,8,0.332359
1/14/2015,Quarter2,sweing,Wednesday,2,0.8,51.02,1086,4260,27,0,0,0,57,0.311207
1/14/2015,Quarter2,'finishing ',Wednesday,2,0.8,3.94,?,1260,0,0,0,0,8,0.247316
1/15/2015,Quarter3,'finishing ',Thursday,4,0.35,4.3,?,3600,0,0,0,0,20,0.988636
1/15/2015,Quarter3,'finishing ',Thursday,10,0.8,3.94,?,3420,0,0,0,0,19,0.95311
1/15/2015,Quarter3,'finishing ',Thursday,1,0.8,3.94,?,1440,0,0,0,0,8,0.884261
1/15/2015,Quarter3,'finishing ',Thursday,5,0.65,4.15,?,1440,0,0,0,0,8,0.860653
1/15/2015,Quarter3,'finishing ',Thursday,9,0.8,3.94,?,1440,0,0,0,0,8,0.858144
1/15/2015,Quarter3,sweing,Thursday,1,0.8,26.16,1160,10620,75,0,0,0,59,0.850502
1/15/2015,Quarter3,sweing,Thursday,8,0.8,25.9,1177,8970,60,0,0,0,56.5,0.850416
1/15/2015,Quarter3,sweing,Thursday,7,0.8,25.9,1281,10170,60,0,0,0,56.5,0.850137
1/15/2015,Quarter3,sweing,Thursday,9,0.8,26.16,1369,10620,63,0,0,0,59,0.800117
1/15/2015,Quarter3,sweing,Thursday,6,0.8,11.61,1084,4950,38,0,0,0,31.5,0.800031
1/15/2015,Quarter3,sweing,Thursday,12,0.8,11.61,1216,4950,50,0,0,0,31.5,0.800031
1/15/2015,Quarter3,sweing,Thursday,5,0.7,20.79,391,10440,0,0,0,0,58,0.70006
1/15/2015,Quarter3,'finishing ',Thursday,7,0.8,2.9,?,1440,0,0,0,0,8,0.689299
1/15/2015,Quarter3,sweing,Thursday,3,0.5,22.52,1102,10170,30,0,0,0,56.5,0.660683
1/15/2015,Quarter3,sweing,Thursday,4,0.65,22.52,872,10080,26,0,0,0,56,0.650131
1/15/2015,Quarter3,'finishing ',Thursday,8,0.8,2.9,?,1440,0,0,0,0,8,0.606913
1/15/2015,Quarter3,sweing,Thursday,10,0.6,22.52,1076,10170,23,0,0,0,56.5,0.600292
1/15/2015,Quarter3,sweing,Thursday,11,0.5,14.89,917,9900,30,0,0,0,55,0.500025
1/15/2015,Quarter3,sweing,Thursday,2,0.5,22.94,1044,9810,23,0,0,0,54.5,0.499999
1/17/2015,Quarter3,'finishing ',Saturday,5,0.65,4.15,?,2700,0,0,0,0,15,0.987197
1/17/2015,Quarter3,'finishing ',Saturday,2,0.8,3.94,?,1800,0,0,0,0,10,0.980909
1/17/2015,Quarter3,'finishing ',Saturday,10,0.8,3.94,?,1440,0,0,0,0,8,0.974621
1/17/2015,Quarter3,'finishing ',Saturday,1,0.8,3.94,?,1440,0,0,0,0,8,0.884261
1/17/2015,Quarter3,'finishing ',Saturday,9,0.8,3.94,?,1800,0,0,0,0,10,0.826803
1/17/2015,Quarter3,sweing,Saturday,6,0.8,11.41,1067,5490,63,0,0,0,30.5,0.800344
1/17/2015,Quarter3,sweing,Saturday,12,0.8,11.61,1039,5670,63,0,0,0,31.5,0.800247
1/17/2015,Quarter3,sweing,Saturday,7,0.8,25.9,1396,10170,50,0,0,0,56.5,0.800129
1/17/2015,Quarter3,sweing,Saturday,8,0.8,25.9,1292,10170,50,0,0,0,56.5,0.800129
1/17/2015,Quarter3,sweing,Saturday,1,0.8,48.68,171,10620,63,0,0,0,59,0.800117
1/17/2015,Quarter3,sweing,Saturday,9,0.8,26.16,1128,10620,63,0,0,0,59,0.800117
1/17/2015,Quarter3,sweing,Saturday,2,0.6,22.94,865,6570,23,0,0,0,56.5,0.770114
1/17/2015,Quarter3,sweing,Saturday,4,0.7,22.52,825,10170,50,0,0,0,56.5,0.700542
1/17/2015,Quarter3,'finishing ',Saturday,8,0.8,2.9,?,1440,0,0,0,0,8,0.675568
1/17/2015,Quarter3,'finishing ',Saturday,7,0.8,2.9,?,1440,0,0,0,0,8,0.661837
1/17/2015,Quarter3,sweing,Saturday,10,0.65,22.52,1163,9720,35,0,0,0,54,0.650199
1/17/2015,Quarter3,sweing,Saturday,3,0.6,22.52,1140,10170,30,0,0,0,56.5,0.600292
1/17/2015,Quarter3,sweing,Saturday,11,0.6,14.89,1027,10080,38,0,0,0,56,0.600273
1/17/2015,Quarter3,'finishing ',Saturday,6,0.8,2.9,?,900,0,0,0,0,5,0.465758
1/17/2015,Quarter3,sweing,Saturday,5,0.7,41.19,1052,10440,21,0,0,0,58,0.452013
1/17/2015,Quarter3,'finishing ',Saturday,11,0.8,4.15,?,1260,0,0,0,0,7,0.313853
1/18/2015,Quarter3,'finishing ',Sunday,5,0.6,4.15,?,1440,0,0,0,0,8,0.852794
1/18/2015,Quarter3,'finishing ',Sunday,11,0.65,4.15,?,2160,0,0,0,0,12,0.838384
1/18/2015,Quarter3,'finishing ',Sunday,6,0.8,2.9,?,1800,0,0,0,0,10,0.804848
1/18/2015,Quarter3,sweing,Sunday,6,0.8,11.41,1140,5490,63,0,0,0,30.5,0.800344
1/18/2015,Quarter3,sweing,Sunday,7,0.8,48.84,624,10170,50,0,0,0,56.5,0.800129
1/18/2015,Quarter3,sweing,Sunday,8,0.8,25.9,1288,10170,38,0,0,0,56.5,0.800129
1/18/2015,Quarter3,sweing,Sunday,9,0.8,26.16,1381,3660,50,0,0,0,59,0.800015
1/18/2015,Quarter3,sweing,Sunday,4,0.7,22.52,882,10170,50,0,0,0,56.5,0.700542
1/18/2015,Quarter3,sweing,Sunday,10,0.7,22.52,1002,10080,40,0,0,0,56,0.700094
1/18/2015,Quarter3,'finishing ',Sunday,7,0.8,2.9,?,1440,0,0,0,0,8,0.692045
1/18/2015,Quarter3,sweing,Sunday,12,0.8,26.87,585,5670,56,0,0,0,31.5,0.662256
1/18/2015,Quarter3,sweing,Sunday,3,0.65,22.52,1138,10170,35,0,0,0,56.5,0.650417
1/18/2015,Quarter3,sweing,Sunday,11,0.65,14.89,1140,10260,44,0,0,0,57,0.6503
1/18/2015,Quarter3,sweing,Sunday,2,0.65,22.94,1025,10170,26,0,0,0,56.5,0.650243
1/18/2015,Quarter3,'finishing ',Sunday,8,0.8,2.9,?,1440,0,0,0,0,8,0.639867
1/18/2015,Quarter3,sweing,Sunday,5,0.6,20.4,1031,10440,30,0,0,0,58,0.600063
1/18/2015,Quarter3,'finishing ',Sunday,9,0.8,3.94,?,1800,0,0,0,0,10,0.582045
1/18/2015,Quarter3,sweing,Sunday,1,0.8,49.1,1381,10350,24,0,0,0,57.5,0.403242
1/18/2015,Quarter3,'finishing ',Sunday,10,0.7,3.94,?,1440,0,0,0,0,8,0.235795
1/19/2015,Quarter3,'finishing ',Monday,4,0.7,4.3,?,5040,0,0,0,0,28,0.977273
1/19/2015,Quarter3,'finishing ',Monday,9,0.8,3.94,?,1800,0,0,0,0,10,0.964106
1/19/2015,Quarter3,'finishing ',Monday,5,0.65,4.15,?,1440,0,0,0,0,8,0.958902
1/19/2015,Quarter3,sweing,Monday,6,0.8,11.41,1028,4380,50,0,0,0,31,0.800359
1/19/2015,Quarter3,sweing,Monday,8,0.8,25.9,1380,3630,50,0,0,0,56.5,0.800163
1/19/2015,Quarter3,sweing,Monday,9,0.8,26.16,1196,10620,63,0,0,0,59,0.800117
1/19/2015,Quarter3,'finishing ',Monday,12,0.8,2.9,?,1440,0,0,0,0,8,0.793845
1/19/2015,Quarter3,sweing,Monday,2,0.7,22.94,1006,10170,38,0,0,0,56.5,0.750518
1/19/2015,Quarter3,sweing,Monday,4,0.7,22.52,930,10260,63,0,0,0,57,0.750068
1/19/2015,Quarter3,sweing,Monday,3,0.7,22.52,1095,10170,50,0,0,0,56.5,0.750063
1/19/2015,Quarter3,sweing,Monday,10,0.7,22.52,938,10080,63,0,0,0,56,0.750057
1/19/2015,Quarter3,sweing,Monday,11,0.7,14.89,1484,10260,50,0,0,0,57,0.70017
1/19/2015,Quarter3,'finishing ',Monday,8,0.8,2.9,?,1440,0,0,0,0,8,0.683807
1/19/2015,Quarter3,sweing,Monday,5,0.65,20.4,1255,8280,35,0,0,0,58,0.650066
1/19/2015,Quarter3,sweing,Monday,7,0.8,48.84,1040,10260,30,0,0,0,57,0.57646
1/19/2015,Quarter3,sweing,Monday,1,0.5,22.94,1492,10170,30,0,0,0,56.5,0.549969
1/19/2015,Quarter3,'finishing ',Monday,10,0.7,3.94,?,1440,0,0,0,0,8,0.5384
1/19/2015,Quarter3,'finishing ',Monday,11,0.7,4.15,?,1440,0,0,0,0,8,0.409545
1/19/2015,Quarter3,sweing,Monday,12,0.35,15.26,1111,6120,23,0,0,0,34,0.350218
1/20/2015,Quarter3,'finishing ',Tuesday,5,0.7,4.15,?,1440,0,0,0,0,8,1.03357
1/20/2015,Quarter3,sweing,Tuesday,6,0.8,11.41,1047,5580,63,0,0,0,31,0.800261
1/20/2015,Quarter3,sweing,Tuesday,8,0.8,25.9,1434,10170,50,0,0,0,56.5,0.800129
1/20/2015,Quarter3,sweing,Tuesday,9,0.8,26.16,399,10620,63,0,0,0,59,0.800117
1/20/2015,Quarter3,sweing,Tuesday,4,0.7,22.52,983,10260,63,0,0,0,57,0.750068
1/20/2015,Quarter3,sweing,Tuesday,10,0.7,22.52,1108,10080,63,0,0,0,56,0.750057
1/20/2015,Quarter3,sweing,Tuesday,3,0.7,22.52,1134,8460,50,0,0,0,57,0.750038
1/20/2015,Quarter3,sweing,Tuesday,2,0.7,22.94,1363,10260,50,0,0,0,57,0.750032
1/20/2015,Quarter3,'finishing ',Tuesday,9,0.8,3.94,?,1800,0,0,0,0,10,0.728303
1/20/2015,Quarter3,sweing,Tuesday,11,0.7,14.89,1501,10260,50,0,0,0,57,0.70017
1/20/2015,Quarter3,sweing,Tuesday,5,0.7,20.4,1352,10260,50,0,0,0,57,0.700064
1/20/2015,Quarter3,'finishing ',Tuesday,8,0.8,2.9,?,1440,0,0,0,0,8,0.639867
1/20/2015,Quarter3,sweing,Tuesday,12,0.5,15.26,1352,3720,23,0,0,0,34,0.50029
1/20/2015,Quarter3,sweing,Tuesday,7,0.35,22.94,1450,10080,30,0,0,0,56,0.400333
1/20/2015,Quarter3,'finishing ',Tuesday,11,0.7,4.15,?,2700,0,0,0,0,15,0.362667
1/21/2015,Quarter3,'finishing ',Wednesday,4,0.75,4.3,?,6000,0,0,0,0,20,0.978526
1/21/2015,Quarter3,'finishing ',Wednesday,2,0.7,3.94,?,5100,0,0,0,0,17,0.912202
1/21/2015,Quarter3,sweing,Wednesday,4,0.75,22.52,825,10080,94,0,0,0,56,0.900556
1/21/2015,Quarter3,sweing,Wednesday,6,0.8,11.61,916,5760,75,0,0,0,89,0.850411
1/21/2015,Quarter3,'finishing ',Wednesday,9,0.8,3.94,?,2400,0,0,0,0,8,0.827147
1/21/2015,Quarter3,sweing,Wednesday,8,0.8,25.9,562,7470,38,0,0,0,56.5,0.800437
1/21/2015,Quarter3,sweing,Wednesday,2,0.7,22.94,1422,10500,60,0,0,0,57,0.800416
1/21/2015,Quarter3,sweing,Wednesday,10,0.7,22.52,1206,10080,75,0,0,0,56,0.800021
1/21/2015,Quarter3,'finishing ',Wednesday,5,0.7,4.15,?,2400,0,0,0,0,8,0.758173
1/21/2015,Quarter3,sweing,Wednesday,5,0.7,20.4,1404,10440,50,0,0,0,58,0.750345
1/21/2015,Quarter3,sweing,Wednesday,3,0.7,22.52,1139,10260,63,0,0,0,57,0.750068
1/21/2015,Quarter3,sweing,Wednesday,11,0.7,14.89,1735,10260,50,0,0,0,57,0.70017
1/21/2015,Quarter3,sweing,Wednesday,1,0.65,22.94,1595,10260,34,0,0,0,57,0.70003
1/21/2015,Quarter3,sweing,Wednesday,12,0.6,15.26,1245,6360,23,0,0,0,34,0.600173
1/21/2015,Quarter3,'finishing ',Wednesday,8,0.8,2.9,?,2400,0,0,0,0,8,0.594872
1/21/2015,Quarter3,sweing,Wednesday,9,0.8,54.56,757,4140,29,0,0,0,58,0.520238
1/21/2015,Quarter3,'finishing ',Wednesday,1,0.65,3.94,?,2400,0,0,0,0,8,0.505128
1/21/2015,Quarter3,sweing,Wednesday,7,0.5,22.52,1720,10080,23,0,0,0,56,0.500241
1/21/2015,Quarter3,'finishing ',Wednesday,11,0.7,4.15,?,2700,0,0,0,0,9,0.470769
1/22/2015,Quarter4,'finishing ',Thursday,7,0.6,3.94,?,6000,0,0,0,0,10,0.957639
1/22/2015,Quarter4,'finishing ',Thursday,10,0.75,3.94,?,8400,0,0,0,0,14,0.940701
1/22/2015,Quarter4,sweing,Thursday,4,0.75,22.52,759,10080,81,0,0,0,56,0.849984
1/22/2015,Quarter4,sweing,Thursday,2,0.7,22.94,1510,10620,60,0,0,0,57,0.800303
1/22/2015,Quarter4,sweing,Thursday,6,0.8,11.61,955,6360,63,0,0,0,32,0.800192
1/22/2015,Quarter4,sweing,Thursday,10,0.75,22.52,1328,10080,55,0,0,0,56,0.800021
1/22/2015,Quarter4,sweing,Thursday,1,0.7,22.94,1384,12180,63,0,0,0,57,0.750162
1/22/2015,Quarter4,sweing,Thursday,3,0.7,22.52,1244,10260,63,0,0,0,57,0.750068
1/22/2015,Quarter4,'finishing ',Thursday,5,0.7,4.15,?,9000,0,0,0,0,15,0.742901
1/22/2015,Quarter4,sweing,Thursday,5,0.7,20.4,1480,10440,40,0,0,0,58,0.700251
1/22/2015,Quarter4,sweing,Thursday,11,0.7,14.89,1863,10260,50,0,0,0,57,0.70017
1/22/2015,Quarter4,'finishing ',Thursday,4,0.75,4.3,?,9000,0,0,0,0,15,0.670216
1/22/2015,Quarter4,'finishing ',Thursday,1,0.7,3.94,?,15000,0,0,0,0,25,0.649662
1/22/2015,Quarter4,'finishing ',Thursday,2,0.7,3.94,?,15000,0,0,0,0,25,0.649662
1/22/2015,Quarter4,'finishing ',Thursday,6,0.8,2.9,?,4800,0,0,0,0,8,0.626823
1/22/2015,Quarter4,sweing,Thursday,12,0.6,15.26,1492,6960,23,0,0,0,34,0.600436
1/22/2015,Quarter4,sweing,Thursday,7,0.6,22.52,1859,10260,23,0,0,0,57,0.600414
1/22/2015,Quarter4,sweing,Thursday,8,0.8,40.99,980,10770,30,0,0,0,56.5,0.5555
1/22/2015,Quarter4,sweing,Thursday,9,0.5,29.12,970,10440,30,0,0,0,58,0.500548
1/22/2015,Quarter4,'finishing ',Thursday,3,0.7,3.94,?,12000,0,0,0,0,20,0.460579
1/22/2015,Quarter4,'finishing ',Thursday,8,0.8,2.9,?,4800,0,0,0,0,8,0.397743
1/22/2015,Quarter4,'finishing ',Thursday,12,0.6,4.08,?,5400,0,0,0,0,9,0.327407
1/24/2015,Quarter4,'finishing ',Saturday,5,0.7,4.15,?,2700,0,0,0,0,15,0.966667
1/24/2015,Quarter4,'finishing ',Saturday,10,0.75,3.94,?,1800,0,0,0,0,10,0.937242
1/24/2015,Quarter4,'finishing ',Saturday,8,0.8,2.9,?,1620,0,0,0,0,9,0.910522
1/24/2015,Quarter4,sweing,Saturday,2,0.75,22.94,1606,10260,94,0,0,0,57,0.900648
1/24/2015,Quarter4,sweing,Saturday,4,0.75,22.52,727,10260,94,0,0,0,57,0.900321
1/24/2015,Quarter4,'finishing ',Saturday,11,0.75,4.15,?,1800,0,0,0,0,10,0.896023
1/24/2015,Quarter4,'finishing ',Saturday,3,0.75,3.94,?,1440,0,0,0,0,8,0.895455
1/24/2015,Quarter4,'finishing ',Saturday,7,0.65,3.94,?,2160,0,0,0,0,12,0.870581
1/24/2015,Quarter4,'finishing ',Saturday,12,0.7,4.08,?,1620,0,0,0,0,9,0.858586
1/24/2015,Quarter4,sweing,Saturday,1,0.7,22.94,1472,10260,75,0,0,0,57,0.800644
1/24/2015,Quarter4,sweing,Saturday,10,0.75,22.52,1332,10080,69,0,0,0,56,0.80063
1/24/2015,Quarter4,sweing,Saturday,6,0.8,11.61,1009,5640,63,0,0,0,32,0.800537
1/24/2015,Quarter4,sweing,Saturday,3,0.75,22.52,1266,10260,69,0,0,0,57,0.800352
1/24/2015,Quarter4,sweing,Saturday,12,0.75,15.26,1316,6120,40,0,0,0,34,0.750079
1/24/2015,Quarter4,sweing,Saturday,11,0.75,42.97,1282,10260,56,0,0,0,57,0.750041
1/24/2015,Quarter4,sweing,Saturday,5,0.7,20.4,1382,10440,50,0,0,0,58,0.700251
1/24/2015,Quarter4,'finishing ',Saturday,4,0.75,4.3,?,2160,0,0,0,0,12,0.651515
1/24/2015,Quarter4,sweing,Saturday,7,0.65,22.52,1295,10170,26,0,0,0,56.5,0.650417
1/24/2015,Quarter4,sweing,Saturday,9,0.6,29.12,925,6660,23,0,0,0,58,0.600125
1/24/2015,Quarter4,'finishing ',Saturday,2,0.75,3.94,?,1440,0,0,0,0,8,0.578314
1/24/2015,Quarter4,'finishing ',Saturday,1,0.7,3.94,?,1440,0,0,0,0,8,0.578314
1/24/2015,Quarter4,sweing,Saturday,8,0.35,15.09,1448,9360,23,0,0,0,52,0.34999
1/24/2015,Quarter4,'finishing ',Saturday,9,0.6,3.94,?,1440,0,0,0,0,8,0.261174
1/25/2015,Quarter4,'finishing ',Sunday,5,0.7,4.15,?,3060,0,0,0,0,17,0.973797
1/25/2015,Quarter4,'finishing ',Sunday,2,0.75,3.94,?,1440,0,0,0,0,8,0.970076
1/25/2015,Quarter4,'finishing ',Sunday,1,0.7,3.94,?,1440,0,0,0,0,8,0.970076
1/25/2015,Quarter4,'finishing ',Sunday,3,0.75,3.94,?,1620,0,0,0,0,9,0.961785
1/25/2015,Quarter4,'finishing ',Sunday,10,0.75,3.94,?,3420,0,0,0,0,19,0.955152
1/25/2015,Quarter4,'finishing ',Sunday,4,0.75,4.3,?,2160,0,0,0,0,12,0.95202
1/25/2015,Quarter4,sweing,Sunday,4,0.75,22.52,867,10260,94,0,0,0,57,0.900321
1/25/2015,Quarter4,sweing,Sunday,2,0.75,22.94,1636,10530,81,0,0,0,58.5,0.850224
1/25/2015,Quarter4,sweing,Sunday,1,0.7,22.94,1682,10530,75,0,0,0,58.5,0.80091
1/25/2015,Quarter4,sweing,Sunday,3,0.75,22.52,1495,10350,55,0,0,0,57.5,0.800513
1/25/2015,Quarter4,sweing,Sunday,6,0.8,11.61,1181,5760,63,0,0,0,32,0.800386
1/25/2015,Quarter4,sweing,Sunday,10,0.75,22.52,1413,10080,69,0,0,0,56,0.800021
1/25/2015,Quarter4,'finishing ',Sunday,7,0.65,3.94,?,2520,0,0,0,0,14,0.749188
1/25/2015,Quarter4,sweing,Sunday,7,0.7,22.52,360,10170,40,0,0,0,56.5,0.700542
1/25/2015,Quarter4,sweing,Sunday,12,0.7,15.26,1296,6120,40,0,0,0,34,0.700437
1/25/2015,Quarter4,sweing,Sunday,5,0.7,20.4,1217,10440,50,0,0,0,58,0.700251
1/25/2015,Quarter4,sweing,Sunday,9,0.65,29.12,1086,10440,26,0,0,0,58,0.650408
1/25/2015,Quarter4,'finishing ',Sunday,12,0.7,4.08,?,1620,0,0,0,0,9,0.618182
1/25/2015,Quarter4,sweing,Sunday,11,0.75,42.97,532,10260,40,0,0,0,57,0.591142
1/25/2015,Quarter4,sweing,Sunday,8,0.5,15.09,1557,720,23,0,0,0,52,0.500062
1/25/2015,Quarter4,'finishing ',Sunday,8,0.8,2.9,?,720,0,0,0,0,4,0.329545
1/26/2015,Quarter4,'finishing ',Monday,3,0.75,3.94,?,1800,0,0,0,0,10,1.059621
1/26/2015,Quarter4,'finishing ',Monday,10,0.75,3.94,?,3780,0,0,0,0,21,0.997792
1/26/2015,Quarter4,'finishing ',Monday,4,0.75,4.3,?,2160,0,0,0,0,12,0.963699
1/26/2015,Quarter4,'finishing ',Monday,5,0.7,4.15,?,2700,0,0,0,0,15,0.959192
1/26/2015,Quarter4,'finishing ',Monday,2,0.75,3.94,?,1800,0,0,0,0,10,0.910379
1/26/2015,Quarter4,'finishing ',Monday,1,0.7,3.94,?,1800,0,0,0,0,10,0.910379
1/26/2015,Quarter4,sweing,Monday,4,0.8,22.52,1016,10170,60,0,0,0,56.5,0.850313
1/26/2015,Quarter4,sweing,Monday,6,0.8,11.61,1072,5760,50,0,0,0,32,0.800386
1/26/2015,Quarter4,sweing,Monday,3,0.75,22.52,1584,10260,69,0,0,0,57,0.800352
1/26/2015,Quarter4,sweing,Monday,2,0.75,22.94,1764,10260,55,0,0,0,57,0.800034
1/26/2015,Quarter4,sweing,Monday,1,0.7,22.94,1745,10440,60,0,0,0,58,0.800024
1/26/2015,Quarter4,sweing,Monday,10,0.75,22.52,1250,10080,55,0,0,0,56,0.800021
1/26/2015,Quarter4,'finishing ',Monday,12,0.7,4.08,?,1620,0,0,0,0,9,0.769293
1/26/2015,Quarter4,sweing,Monday,5,0.75,20.4,1118,10320,56,0,0,0,58,0.750031
1/26/2015,Quarter4,sweing,Monday,9,0.7,29.12,1143,10440,40,0,0,0,58,0.700614
1/26/2015,Quarter4,sweing,Monday,12,0.7,15.26,1337,6120,40,0,0,0,34,0.700437
1/26/2015,Quarter4,'finishing ',Monday,7,0.65,3.94,?,1440,0,0,0,0,8,0.646307
1/26/2015,Quarter4,sweing,Monday,8,0.6,15.09,1519,360,23,0,0,0,52,0.600143
1/26/2015,Quarter4,sweing,Monday,11,0.35,28.08,749,10260,23,0,0,0,57,0.350067
1/27/2015,Quarter4,sweing,Tuesday,2,0.75,22.52,1635,6840,119,0,0,0,57,1.00023
1/27/2015,Quarter4,sweing,Tuesday,3,0.75,22.52,1299,6840,119,0,0,0,57,1.00023
1/27/2015,Quarter4,'finishing ',Tuesday,10,0.8,3.94,?,1440,0,0,0,0,12,0.979528
1/27/2015,Quarter4,'finishing ',Tuesday,4,0.8,4.3,?,1440,0,0,0,0,12,0.940625
1/27/2015,Quarter4,'finishing ',Tuesday,5,0.5,4.15,?,1440,0,0,0,0,12,0.926389
1/27/2015,Quarter4,sweing,Tuesday,10,0.8,22.52,1134,6720,70,0,0,0,56,0.90013
1/27/2015,Quarter4,'finishing ',Tuesday,3,0.75,3.94,?,1440,0,0,0,0,12,0.861875
1/27/2015,Quarter4,sweing,Tuesday,4,0.8,22.52,1106,6780,60,0,0,0,56.5,0.850313
1/27/2015,Quarter4,'finishing ',Tuesday,8,0.65,3.94,?,960,0,0,0,0,8,0.845458
1/27/2015,Quarter4,'finishing ',Tuesday,12,0.7,4.15,?,1080,0,0,0,0,9,0.823556
1/27/2015,Quarter4,'finishing ',Tuesday,7,0.5,4.15,?,960,0,0,0,0,8,0.803542
1/27/2015,Quarter4,sweing,Tuesday,1,0.75,22.94,1871,6960,55,0,0,0,58,0.800263
1/27/2015,Quarter4,'finishing ',Tuesday,2,0.75,3.94,?,1200,0,0,0,0,10,0.788
1/27/2015,Quarter4,'finishing ',Tuesday,1,0.75,3.94,?,1200,0,0,0,0,10,0.77815
1/27/2015,Quarter4,sweing,Tuesday,9,0.7,29.12,1294,6960,50,0,0,0,58,0.700386
1/27/2015,Quarter4,sweing,Tuesday,12,0.7,15.26,1462,4080,40,0,0,0,34,0.700165
1/27/2015,Quarter4,sweing,Tuesday,8,0.65,15.09,976,240,23,0,0,0,52,0.650307
1/27/2015,Quarter4,sweing,Tuesday,6,0.8,30.4,338,3840,34,0,0,0,32,0.622828
1/27/2015,Quarter4,'finishing ',Tuesday,6,0.8,2.9,?,960,0,0,0,0,8,0.6225
1/27/2015,Quarter4,sweing,Tuesday,5,0.5,20.79,1455,6960,30,0,0,0,58,0.500035
1/27/2015,Quarter4,sweing,Tuesday,11,0.5,48.18,1282,6480,23,0,0,0,54,0.370467
1/28/2015,Quarter4,sweing,Wednesday,2,0.8,22.52,1559,6840,90,0,0,0,57,1.00023
1/28/2015,Quarter4,sweing,Wednesday,3,0.8,22.52,1350,6840,113,0,0,0,57,1.00023
1/28/2015,Quarter4,'finishing ',Wednesday,6,0.35,2.9,?,1800,0,0,0,0,15,0.977556
1/28/2015,Quarter4,'finishing ',Wednesday,1,0.75,3.94,?,1200,0,0,0,0,10,0.9456
1/28/2015,Quarter4,'finishing ',Wednesday,2,0.8,3.94,?,1800,0,0,0,0,15,0.902222
1/28/2015,Quarter4,sweing,Wednesday,10,0.8,22.52,1175,6720,60,0,0,0,56,0.850532
1/28/2015,Quarter4,sweing,Wednesday,1,0.75,22.94,1868,6960,81,0,0,0,58,0.850362
1/28/2015,Quarter4,'finishing ',Wednesday,10,0.8,3.94,?,1200,0,0,0,0,10,0.840533
1/28/2015,Quarter4,sweing,Wednesday,5,0.6,20.79,1045,6960,88,0,0,0,58,0.800534
1/28/2015,Quarter4,sweing,Wednesday,4,0.8,22.52,1342,6780,50,0,0,0,56.5,0.80049
1/28/2015,Quarter4,'finishing ',Wednesday,12,0.75,4.08,?,1080,0,0,0,0,9,0.755556
1/28/2015,Quarter4,sweing,Wednesday,9,0.7,29.12,1340,6960,63,0,0,0,58,0.750593
1/28/2015,Quarter4,sweing,Wednesday,12,0.75,15.26,1429,3600,45,0,0,0,35,0.750283
1/28/2015,Quarter4,'finishing ',Wednesday,4,0.8,4.3,?,1440,0,0,0,0,12,0.722639
1/28/2015,Quarter4,'finishing ',Wednesday,8,0.65,4.15,?,960,0,0,0,0,8,0.553333
1/28/2015,Quarter4,sweing,Wednesday,11,0.5,20.1,1413,5880,46,0,0,0,54,0.500567
1/28/2015,Quarter4,sweing,Wednesday,8,0.7,38.09,336,6240,0,0,0,0,52,0.467693
1/28/2015,Quarter4,sweing,Wednesday,6,0.35,18.79,511,1800,23,0,0,0,32,0.437995
1/28/2015,Quarter4,'finishing ',Wednesday,7,0.6,3.94,?,960,0,0,0,0,8,0.406354
1/28/2015,Quarter4,sweing,Wednesday,7,0.6,23.54,958,6600,0,0,0,0,55,0.285333
1/28/2015,Quarter4,'finishing ',Wednesday,11,0.5,2.9,?,960,0,0,0,0,8,0.259375
1/29/2015,Quarter5,sweing,Thursday,2,0.8,22.52,1416,6840,113,0,0,0,57,1.00023
1/29/2015,Quarter5,'finishing ',Thursday,4,0.8,4.3,?,1200,0,0,0,0,10,0.989
1/29/2015,Quarter5,sweing,Thursday,3,0.8,22.52,1287,6840,100,0,0,0,57,0.950186
1/29/2015,Quarter5,sweing,Thursday,4,0.8,22.52,1444,6900,88,0,0,0,57.5,0.9008
1/29/2015,Quarter5,sweing,Thursday,10,0.8,22.52,1088,6720,88,0,0,0,56,0.90013
1/29/2015,Quarter5,'finishing ',Thursday,6,0.5,2.9,?,1200,0,0,0,0,10,0.899
1/29/2015,Quarter5,'finishing ',Thursday,8,0.65,4.15,?,960,0,0,0,0,8,0.877552
1/29/2015,Quarter5,'finishing ',Thursday,11,0.6,2.9,?,960,0,0,0,0,8,0.864583
1/29/2015,Quarter5,'finishing ',Thursday,10,0.8,3.94,?,1200,0,0,0,0,10,0.85695
1/29/2015,Quarter5,'finishing ',Thursday,1,0.75,3.94,?,1200,0,0,0,0,10,0.853667
1/29/2015,Quarter5,sweing,Thursday,1,0.75,22.94,1579,6960,81,0,0,0,58,0.850362
1/29/2015,Quarter5,sweing,Thursday,9,0.7,29.12,1170,6960,53,0,0,0,58,0.85017
1/29/2015,Quarter5,sweing,Thursday,5,0.65,20.79,1015,7080,81,0,0,0,59,0.800474
1/29/2015,Quarter5,'finishing ',Thursday,2,0.8,3.94,?,1200,0,0,0,0,10,0.773333
1/29/2015,Quarter5,sweing,Thursday,12,0.75,15.26,1436,4200,45,0,0,0,35,0.750647
1/29/2015,Quarter5,'finishing ',Thursday,12,0.75,4.08,?,1080,0,0,0,0,9,0.634667
1/29/2015,Quarter5,sweing,Thursday,11,0.6,20.1,1601,4320,46,0,0,0,51,0.600598
1/29/2015,Quarter5,sweing,Thursday,6,0.5,18.79,717,3960,23,0,0,0,33,0.500118
1/29/2015,Quarter5,'finishing ',Thursday,3,0.8,3.94,?,960,0,0,0,0,8,0.4925
1/29/2015,Quarter5,sweing,Thursday,7,0.65,23.54,830,6600,0,0,0,0,55,0.48792
1/31/2015,Quarter5,sweing,Saturday,3,0.8,22.52,1136,6960,113,0,0,0,58,1.000457
1/31/2015,Quarter5,sweing,Saturday,2,0.8,22.52,1397,6840,113,0,0,0,57,1.00023
1/31/2015,Quarter5,'finishing ',Saturday,2,0.8,3.94,?,1200,0,0,0,0,10,0.971867
1/31/2015,Quarter5,'finishing ',Saturday,3,0.8,3.94,?,960,0,0,0,0,8,0.971867
1/31/2015,Quarter5,'finishing ',Saturday,4,0.8,3.94,?,1200,0,0,0,0,10,0.971867
1/31/2015,Quarter5,'finishing ',Saturday,10,0.8,3.94,?,1200,0,0,0,0,10,0.971867
1/31/2015,Quarter5,'finishing ',Saturday,1,0.75,3.94,?,1800,0,0,0,0,15,0.971867
1/31/2015,Quarter5,'finishing ',Saturday,9,0.75,3.94,?,240,0,0,0,0,2,0.971867
1/31/2015,Quarter5,'finishing ',Saturday,12,0.75,4.08,?,1080,0,0,0,0,9,0.971867
1/31/2015,Quarter5,'finishing ',Saturday,5,0.7,3.94,?,240,0,0,0,0,2,0.971867
1/31/2015,Quarter5,'finishing ',Saturday,7,0.7,3.94,?,1200,0,0,0,0,10,0.971867
1/31/2015,Quarter5,'finishing ',Saturday,8,0.65,3.94,?,960,0,0,0,0,8,0.971867
1/31/2015,Quarter5,'finishing ',Saturday,11,0.65,3.94,?,600,0,0,0,0,5,0.971867
1/31/2015,Quarter5,'finishing ',Saturday,6,0.6,3.94,?,1200,0,0,0,0,10,0.971867
1/31/2015,Quarter5,sweing,Saturday,10,0.8,22.52,1116,6720,93,0,0,0,56,0.920237
1/31/2015,Quarter5,sweing,Saturday,4,0.8,22.52,1432,6660,88,0,0,0,57.5,0.900537
1/31/2015,Quarter5,sweing,Saturday,9,0.75,29.12,1082,6840,81,0,0,0,57,0.850611
1/31/2015,Quarter5,sweing,Saturday,1,0.75,22.94,1502,6960,81,0,0,0,58,0.850362
1/31/2015,Quarter5,sweing,Saturday,12,0.75,15.26,1209,4200,45,0,0,0,35,0.750647
1/31/2015,Quarter5,sweing,Saturday,5,0.7,50.89,282,5880,56,0,0,0,59,0.656764
1/31/2015,Quarter5,sweing,Saturday,11,0.65,20.1,1417,6480,49,0,0,0,54,0.650148
1/31/2015,Quarter5,sweing,Saturday,6,0.6,18.79,799,3960,23,0,0,0,33,0.600711
1/31/2015,Quarter5,sweing,Saturday,7,0.7,23.54,1109,6720,0,0,0,0,56,0.38883
1/31/2015,Quarter5,sweing,Saturday,8,0.5,23.54,1144,6480,0,0,0,0,54,0.286985
2/1/2015,Quarter1,'finishing ',Sunday,8,0.65,4.15,?,960,0,0,0,0,8,1.011562
2/1/2015,Quarter1,sweing,Sunday,2,0.8,22.52,1396,6900,113,0,0,0,57.5,1.000671
2/1/2015,Quarter1,sweing,Sunday,1,0.8,22.94,1582,3060,113,0,0,0,58.5,1.000402
2/1/2015,Quarter1,'finishing ',Sunday,1,0.75,3.94,?,2280,0,0,0,0,19,0.950439
2/1/2015,Quarter1,sweing,Sunday,3,0.8,22.52,1124,6840,100,0,0,0,57,0.950186
2/1/2015,Quarter1,'finishing ',Sunday,2,0.8,3.94,?,1200,0,0,0,0,10,0.912767
2/1/2015,Quarter1,'finishing ',Sunday,7,0.7,3.94,?,2160,0,0,0,0,18,0.892194
2/1/2015,Quarter1,'finishing ',Sunday,10,0.8,3.94,?,1200,0,0,0,0,10,0.8865
2/1/2015,Quarter1,sweing,Sunday,10,0.8,22.52,1282,6720,75,0,0,0,56,0.850532
2/1/2015,Quarter1,sweing,Sunday,4,0.8,22.52,1472,7020,60,0,0,0,58.5,0.850114
2/1/2015,Quarter1,'finishing ',Sunday,4,0.8,4.3,?,1440,0,0,0,0,12,0.845069
2/1/2015,Quarter1,sweing,Sunday,9,0.75,29.12,1282,6960,45,0,0,0,58,0.750593
2/1/2015,Quarter1,sweing,Sunday,12,0.75,15.26,1276,1440,45,0,0,0,35,0.750451
2/1/2015,Quarter1,'finishing ',Sunday,12,0.75,4.08,?,1080,0,0,0,0,9,0.702667
2/1/2015,Quarter1,sweing,Sunday,11,0.7,20.1,1192,6120,75,0,0,0,54,0.700509
2/1/2015,Quarter1,sweing,Sunday,6,0.65,18.79,881,3960,26,0,0,0,33,0.651007
2/1/2015,Quarter1,sweing,Sunday,8,0.6,24.26,1196,6600,0,0,0,0,55,0.466821
2/1/2015,Quarter1,sweing,Sunday,7,0.7,24.26,1400,6720,0,0,0,0,56,0.411554
2/1/2015,Quarter1,'finishing ',Sunday,6,0.6,2.9,?,1200,0,0,0,0,10,0.314167
2/2/2015,Quarter1,sweing,Monday,1,0.8,22.94,16882,7020,113,0,0,0,58.5,1.000602
2/2/2015,Quarter1,'finishing ',Monday,9,0.75,3.94,?,960,0,0,0,0,8,0.994271
2/2/2015,Quarter1,sweing,Monday,2,0.8,22.52,21385,7020,88,0,0,0,58.5,0.900158
2/2/2015,Quarter1,sweing,Monday,3,0.8,22.52,21266,6840,70,0,0,0,57,0.900142
2/2/2015,Quarter1,sweing,Monday,10,0.8,22.52,21540,6720,88,0,0,0,56,0.90013
2/2/2015,Quarter1,'finishing ',Monday,10,0.8,3.94,?,1200,0,0,0,0,10,0.85695
2/2/2015,Quarter1,'finishing ',Monday,4,0.8,4.3,?,1440,0,0,0,0,12,0.809236
2/2/2015,Quarter1,sweing,Monday,12,0.8,15.26,12261,3600,63,0,0,0,35,0.800402
2/2/2015,Quarter1,sweing,Monday,4,0.8,22.52,23122,5940,50,0,0,0,56.5,0.800393
2/2/2015,Quarter1,sweing,Monday,9,0.75,29.12,8992,6960,55,0,0,0,58,0.799963
2/2/2015,Quarter1,'finishing ',Monday,12,0.75,4.08,?,1080,0,0,0,0,9,0.740444
2/2/2015,Quarter1,sweing,Monday,11,0.7,20.55,9792,6480,60,0,0,0,54,0.700398
2/2/2015,Quarter1,sweing,Monday,6,0.7,18.79,2984,3960,30,0,0,0,33,0.700355
2/2/2015,Quarter1,'finishing ',Monday,8,0.65,4.15,?,960,0,0,0,0,8,0.561979
2/2/2015,Quarter1,'finishing ',Monday,1,0.75,3.94,?,2280,0,0,0,0,19,0.504596
2/2/2015,Quarter1,sweing,Monday,5,0.5,30.1,839,6960,0,0,0,0,58,0.500802
2/2/2015,Quarter1,sweing,Monday,7,0.7,24.26,2698,6720,0,0,0,0,56,0.295308
2/2/2015,Quarter1,'finishing ',Monday,6,0.6,2.9,?,1200,0,0,0,0,10,0.280333
2/2/2015,Quarter1,sweing,Monday,8,0.65,24.26,1435,6600,0,0,0,0,55,0.260979
2/3/2015,Quarter1,'finishing ',Tuesday,2,0.8,3.94,?,2400,0,0,0,0,20,1.001417
2/3/2015,Quarter1,sweing,Tuesday,1,0.8,22.52,1500,6900,113,0,0,0,57.5,1.000019
2/3/2015,Quarter1,sweing,Tuesday,10,0.8,22.52,1188,6720,90,0,0,0,56,0.999995
2/3/2015,Quarter1,'finishing ',Tuesday,1,0.8,3.94,?,1200,0,0,0,0,10,0.99485
2/3/2015,Quarter1,'finishing ',Tuesday,8,0.7,4.15,?,960,0,0,0,0,8,0.976979
2/3/2015,Quarter1,sweing,Tuesday,3,0.8,22.52,1112,6840,100,0,0,0,57,0.950186
2/3/2015,Quarter1,sweing,Tuesday,2,0.8,22.52,1452,6960,100,0,0,0,58,0.949982
2/3/2015,Quarter1,'finishing ',Tuesday,9,0.75,3.94,?,1320,0,0,0,0,11,0.919955
2/3/2015,Quarter1,sweing,Tuesday,4,0.8,22.52,340,5460,63,0,0,0,56.5,0.800435
2/3/2015,Quarter1,sweing,Tuesday,12,0.8,15.26,1029,2040,50,0,0,0,35,0.800259
2/3/2015,Quarter1,'finishing ',Tuesday,12,0.8,4.08,?,1080,0,0,0,0,9,0.778222
2/3/2015,Quarter1,sweing,Tuesday,9,0.75,29.12,1070,6960,34,0,0,0,58,0.750593
2/3/2015,Quarter1,sweing,Tuesday,11,0.7,25.31,946,5760,60,0,0,0,54,0.700514
2/3/2015,Quarter1,sweing,Tuesday,6,0.7,18.79,913,4020,30,0,0,0,33.5,0.700185
2/3/2015,Quarter1,sweing,Tuesday,8,0.7,24.26,1363,6660,0,0,0,0,55.5,0.586465
2/3/2015,Quarter1,sweing,Tuesday,7,0.7,24.26,1639,6720,0,0,0,0,56,0.541518
2/3/2015,Quarter1,'finishing ',Tuesday,4,0.8,4.3,?,1440,0,0,0,0,12,0.5375
2/3/2015,Quarter1,'finishing ',Tuesday,6,0.7,2.9,?,960,0,0,0,0,8,0.495417
2/3/2015,Quarter1,sweing,Tuesday,5,0.6,30.1,415,6960,0,0,0,0,58,0.415172
2/4/2015,Quarter1,sweing,Wednesday,2,0.8,22.52,1263,6900,100,0,0,0,57.5,1.050281
2/4/2015,Quarter1,sweing,Wednesday,3,0.8,22.52,968,6840,113,0,0,0,57,1.00023
2/4/2015,Quarter1,sweing,Wednesday,10,0.8,22.52,1108,6720,113,0,0,0,56,0.999995
2/4/2015,Quarter1,finishing,Wednesday,2,0.8,3.94,?,2160,0,0,0,0,18,0.966759
2/4/2015,Quarter1,finishing,Wednesday,1,0.8,3.94,?,1200,0,0,0,0,10,0.929183
2/4/2015,Quarter1,finishing,Wednesday,8,0.7,4.15,?,3000,0,0,0,0,25,0.915767
2/4/2015,Quarter1,sweing,Wednesday,1,0.8,22.52,1532,6900,88,0,0,0,57.5,0.900147
2/4/2015,Quarter1,sweing,Wednesday,12,0.8,15.26,1094,4080,38,0,0,0,34,0.800402
2/4/2015,Quarter1,sweing,Wednesday,9,0.8,22.52,1086,6960,50,0,0,0,58,0.799963
2/4/2015,Quarter1,finishing,Wednesday,7,0.7,3.94,?,960,0,0,0,0,8,0.779792
2/4/2015,Quarter1,finishing,Wednesday,9,0.75,3.94,?,960,0,0,0,0,8,0.755167
2/4/2015,Quarter1,sweing,Wednesday,6,0.7,18.79,941,3360,30,0,0,0,33,0.70071
2/4/2015,Quarter1,sweing,Wednesday,7,0.7,24.26,1471,6960,0,0,0,0,58,0.700612
2/4/2015,Quarter1,sweing,Wednesday,11,0.7,10.05,1042,6120,60,0,0,0,53,0.700279
2/4/2015,Quarter1,sweing,Wednesday,8,0.7,29.12,1248,6840,0,0,0,0,57,0.700135
2/4/2015,Quarter1,'finishing ',Wednesday,12,0.8,4.08,?,1080,0,0,0,0,9,0.687556
2/4/2015,Quarter1,sweing,Wednesday,5,0.65,30.1,326,5820,0,90,10,0,58.5,0.650835
2/4/2015,Quarter1,finishing,Wednesday,6,0.7,2.9,?,960,0,0,0,0,8,0.531667
2/4/2015,Quarter1,sweing,Wednesday,4,0.35,30.1,287,6060,23,150,15,0,55.5,0.350706
2/5/2015,Quarter1,sweing,Thursday,2,0.8,22.52,1300,6780,113,0,0,0,56.5,1.000446
2/5/2015,Quarter1,sweing,Thursday,1,0.8,22.52,1485,6900,113,0,0,0,57.5,1.000019
2/5/2015,Quarter1,sweing,Thursday,10,0.8,22.52,1039,6720,113,0,0,0,56,0.999995
2/5/2015,Quarter1,finishing,Thursday,2,0.8,3.94,?,2640,0,0,0,0,22,0.999924
2/5/2015,Quarter1,sweing,Thursday,3,0.8,22.52,1063,6840,100,0,0,0,57,0.950186
2/5/2015,Quarter1,finishing,Thursday,6,0.7,2.9,?,960,0,0,0,0,8,0.9425
2/5/2015,Quarter1,finishing,Thursday,12,0.8,4.08,?,1080,0,0,0,0,9,0.906667
2/5/2015,Quarter1,finishing,Thursday,7,0.7,3.94,?,1200,0,0,0,0,10,0.8471
2/5/2015,Quarter1,finishing,Thursday,1,0.8,3.94,?,1440,0,0,0,0,12,0.845458
2/5/2015,Quarter1,sweing,Thursday,12,0.8,15.26,1083,720,38,0,0,0,34,0.800613
2/5/2015,Quarter1,sweing,Thursday,9,0.8,29.12,1069,6960,50,0,0,0,58,0.799963
2/5/2015,Quarter1,finishing,Thursday,10,0.8,3.94,?,960,0,0,0,0,8,0.771583
2/5/2015,Quarter1,sweing,Thursday,11,0.75,10.05,668,2520,34,0,0,0,26,0.7504
2/5/2015,Quarter1,sweing,Thursday,6,0.7,18.79,766,2760,30,0,0,0,33,0.700079
2/5/2015,Quarter1,sweing,Thursday,5,0.7,30.1,557,6960,0,0,0,0,58,0.562213
2/5/2015,Quarter1,sweing,Thursday,7,0.07,24.26,1608,6960,0,0,0,0,58,0.522845
2/5/2015,Quarter1,sweing,Thursday,4,0.5,30.1,417,6360,23,0,0,1,53,0.50072
2/5/2015,Quarter1,sweing,Thursday,8,0.7,24.26,1167,6840,0,0,0,0,57,0.49655
2/7/2015,Quarter1,finishing,Saturday,2,0.8,3.94,?,3000,0,0,0,0,25,1.050667
2/7/2015,Quarter1,sweing,Saturday,2,0.8,22.52,1186,6900,113,0,0,0,58,1.000019
2/7/2015,Quarter1,sweing,Saturday,3,0.8,22.52,1060,6840,100,0,0,0,57,0.950186
2/7/2015,Quarter1,sweing,Saturday,1,0.8,22.52,1534,6780,88,0,0,0,57,0.900136
2/7/2015,Quarter1,sweing,Saturday,10,0.8,22.52,1142,6720,88,0,0,0,56,0.90013
2/7/2015,Quarter1,finishing,Saturday,12,0.8,4.08,?,1080,0,0,0,0,9,0.899111
2/7/2015,Quarter1,finishing,Saturday,1,0.8,3.94,?,1200,0,0,0,0,10,0.870083
2/7/2015,Quarter1,finishing,Saturday,6,0.75,2.9,?,960,0,0,0,0,8,0.845833
2/7/2015,Quarter1,sweing,Saturday,12,0.8,15.26,1021,4080,63,0,0,0,34,0.800402
2/7/2015,Quarter1,sweing,Saturday,9,0.8,29.12,829,6960,50,0,0,0,58,0.799963
2/7/2015,Quarter1,finishing,Saturday,9,0.8,3.94,?,960,0,0,0,0,8,0.771583
2/7/2015,Quarter1,sweing,Saturday,6,0.75,18.79,813,1560,34,0,0,0,33,0.75052
2/7/2015,Quarter1,sweing,Saturday,11,0.75,10.05,677,3240,45,0,0,0,27,0.750028
2/7/2015,Quarter1,finishing,Saturday,7,0.7,3.94,?,1200,0,0,0,0,10,0.715767
2/7/2015,Quarter1,sweing,Saturday,7,0.7,24.26,658,6960,0,270,45,0,58,0.66227
2/7/2015,Quarter1,sweing,Saturday,4,0.6,30.1,486,6780,30,0,0,1,57,0.600224
2/7/2015,Quarter1,sweing,Saturday,5,0.7,30.1,687,7500,0,0,0,0,59,0.545658
2/7/2015,Quarter1,finishing,Saturday,4,0.8,4.3,?,960,0,0,0,0,8,0.447917
2/7/2015,Quarter1,sweing,Saturday,8,0.7,24.26,652,6840,0,300,37,0,57,0.365319
2/8/2015,Quarter2,sweing,Sunday,2,0.8,22.52,1233,6900,113,0,0,0,57.5,1.000019
2/8/2015,Quarter2,finishing,Sunday,7,0.7,4.15,?,1440,0,0,0,0,12,0.928681
2/8/2015,Quarter2,sweing,Sunday,10,0.8,22.52,1388,6720,88,0,0,0,56,0.9008
2/8/2015,Quarter2,sweing,Sunday,1,0.8,22.52,1615,6780,88,0,0,0,56.5,0.900136
2/8/2015,Quarter2,sweing,Sunday,3,0.8,22.52,1283,6720,88,0,0,0,56,0.90013
2/8/2015,Quarter2,finishing,Sunday,1,0.8,3.94,?,1200,0,0,0,0,10,0.893067
2/8/2015,Quarter2,finishing,Sunday,12,0.8,4.08,?,1080,0,0,0,0,9,0.891556
2/8/2015,Quarter2,finishing,Sunday,2,0.8,3.94,?,2160,0,0,0,0,18,0.875556
2/8/2015,Quarter2,finishing,Sunday,8,0.7,4.15,?,1800,0,0,0,0,15,0.840889
2/8/2015,Quarter2,sweing,Sunday,12,0.8,15.26,1026,2880,63,0,0,0,34,0.800355
2/8/2015,Quarter2,sweing,Sunday,9,0.8,29.12,909,6960,50,0,0,0,58,0.799963
2/8/2015,Quarter2,sweing,Sunday,6,0.75,18.79,670,3960,34,0,0,0,33,0.750651
2/8/2015,Quarter2,sweing,Sunday,11,0.75,10.05,629,3240,45,0,0,0,27,0.750028
2/8/2015,Quarter2,sweing,Sunday,5,0.7,30.1,754,7020,0,0,0,0,58.5,0.700618
2/8/2015,Quarter2,finishing,Sunday,6,0.75,2.9,?,960,0,0,0,0,8,0.610208
2/8/2015,Quarter2,finishing,Sunday,9,0.8,3.94,?,960,0,0,0,0,8,0.607417
2/8/2015,Quarter2,sweing,Sunday,4,0.65,30.1,712,6780,44,0,0,1,56.5,0.56826
2/8/2015,Quarter2,sweing,Sunday,7,0.7,24.26,148,6960,0,0,0,0,58,0.355534
2/8/2015,Quarter2,sweing,Sunday,8,0.7,24.26,154,6840,0,0,0,0,57,0.35326
2/9/2015,Quarter2,finishing,Monday,2,0.8,3.94,?,2160,0,0,0,0,18,1.057963
2/9/2015,Quarter2,finishing,Monday,1,0.8,3.94,?,1200,0,0,0,0,10,0.962017
2/9/2015,Quarter2,sweing,Monday,10,0.8,22.52,1127,120,88,0,0,0,56,0.9008
2/9/2015,Quarter2,sweing,Monday,1,0.8,22.52,1506,3600,70,0,0,0,57,0.900509
2/9/2015,Quarter2,sweing,Monday,2,0.8,22.52,1413,360,70,0,0,0,57,0.900478
2/9/2015,Quarter2,finishing,Monday,6,0.75,2.9,?,960,0,0,0,0,8,0.888125
2/9/2015,Quarter2,sweing,Monday,12,0.8,15.26,970,4080,63,0,0,0,34,0.800402
2/9/2015,Quarter2,sweing,Monday,3,0.8,22.52,1271,5400,50,0,0,0,57,0.800161
2/9/2015,Quarter2,sweing,Monday,9,0.8,29.12,1073,6960,50,0,0,0,58,0.799963
2/9/2015,Quarter2,sweing,Monday,4,0.7,30.1,767,3300,50,0,0,1,57,0.790003
2/9/2015,Quarter2,sweing,Monday,11,0.75,10.05,103,0,45,0,0,0,54,0.750648
2/9/2015,Quarter2,finishing,Monday,8,0.35,4.15,?,1800,0,0,0,0,15,0.707111
2/9/2015,Quarter2,sweing,Monday,5,0.7,30.1,773,7020,40,0,0,0,58,0.700618
2/9/2015,Quarter2,finishing,Monday,9,0.8,3.94,?,960,0,0,0,0,8,0.697708
2/9/2015,Quarter2,sweing,Monday,6,0.75,18.79,708,4080,0,0,0,0,34,0.612517
2/9/2015,Quarter2,sweing,Monday,7,0.35,30.1,842,6960,0,0,0,1,58,0.350302
2/9/2015,Quarter2,sweing,Monday,8,0.35,30.1,901,6960,0,0,0,1,58,0.350302
2/9/2015,Quarter2,finishing,Monday,12,0.8,4.08,?,1080,0,0,0,0,9,0.272
2/10/2015,Quarter2,finishing,Tuesday,12,0.8,4.08,?,1080,0,0,0,0,9,1.004889
2/10/2015,Quarter2,finishing,Tuesday,2,0.8,3.94,?,2160,0,0,0,0,18,0.966759
2/10/2015,Quarter2,sweing,Tuesday,10,0.8,22.52,1268,0,88,0,0,0,56,0.900632
2/10/2015,Quarter2,sweing,Tuesday,1,0.8,22.52,1546,0,88,0,0,0,57,0.900471
2/10/2015,Quarter2,sweing,Tuesday,3,0.8,22.52,813,0,88,0,0,0,57,0.900471
2/10/2015,Quarter2,sweing,Tuesday,2,0.8,22.52,1512,0,88,0,0,0,57,0.899984
2/10/2015,Quarter2,finishing,Tuesday,1,0.8,3.94,?,1440,0,0,0,0,12,0.853667
2/10/2015,Quarter2,sweing,Tuesday,9,0.8,29.12,1263,2160,38,0,0,0,58,0.8008
2/10/2015,Quarter2,sweing,Tuesday,12,0.8,15.26,900,4080,50,0,0,0,34,0.800402
2/10/2015,Quarter2,finishing,Tuesday,4,0.7,4.15,?,1800,0,0,0,0,15,0.796756
2/10/2015,Quarter2,sweing,Tuesday,6,0.75,18.79,640,2400,0,0,0,0,34,0.750797
2/10/2015,Quarter2,sweing,Tuesday,11,0.8,10.05,13,3240,34,0,0,0,54,0.750648
2/10/2015,Quarter2,sweing,Tuesday,5,0.75,30.1,855,7020,45,0,0,0,58,0.750356
2/10/2015,Quarter2,finishing,Tuesday,8,0.35,4.15,?,960,0,0,0,0,8,0.703771
2/10/2015,Quarter2,sweing,Tuesday,4,0.7,30.1,855,7020,40,0,0,1,58,0.700618
2/10/2015,Quarter2,finishing,Tuesday,9,0.8,3.94,?,960,0,0,0,0,8,0.6895
2/10/2015,Quarter2,finishing,Tuesday,6,0.75,2.9,?,960,0,0,0,0,8,0.628333
2/10/2015,Quarter2,sweing,Tuesday,7,0.5,30.1,1025,6960,23,0,0,1,58,0.500802
2/10/2015,Quarter2,sweing,Tuesday,8,0.5,30.1,1061,6960,30,0,0,1,58,0.393549
2/11/2015,Quarter2,finishing,Wednesday,4,0.7,4.15,?,1800,0,0,0,0,15,1.033156
2/11/2015,Quarter2,finishing,Wednesday,12,0.8,4.08,?,1080,0,0,0,0,9,1.02
2/11/2015,Quarter2,sweing,Wednesday,2,0.8,22.52,1557,0,90,0,0,0,57.5,1.000345
2/11/2015,Quarter2,sweing,Wednesday,1,0.8,22.52,1498,0,113,0,0,0,57,1.000066
2/11/2015,Quarter2,finishing,Wednesday,8,0.35,4.15,?,1440,0,0,0,0,12,0.994375
2/11/2015,Quarter2,finishing,Wednesday,2,0.8,3.94,?,2160,0,0,0,0,18,0.912037
2/11/2015,Quarter2,finishing,Wednesday,5,0.7,4.15,?,240,0,0,0,0,2,0.87
2/11/2015,Quarter2,sweing,Wednesday,10,0.8,22.52,598,0,75,0,0,0,56,0.850365
2/11/2015,Quarter2,sweing,Wednesday,6,0.8,18.79,656,3480,38,0,0,0,34,0.800947
2/11/2015,Quarter2,sweing,Wednesday,12,0.8,15.26,854,4080,50,0,0,0,34,0.800402
2/11/2015,Quarter2,sweing,Wednesday,9,0.8,29.12,609,3240,50,0,0,0,58,0.800144
2/11/2015,Quarter2,sweing,Wednesday,5,0.75,30.1,788,7380,56,0,0,0,59.5,0.750406
2/11/2015,Quarter2,sweing,Wednesday,8,0.6,30.1,1069,4560,30,0,0,1,58,0.71441
2/11/2015,Quarter2,sweing,Wednesday,4,0.7,30.1,667,5940,40,0,0,1,59.5,0.700588
2/11/2015,Quarter2,finishing,Wednesday,1,0.8,3.94,?,1440,0,0,0,0,12,0.618361
2/11/2015,Quarter2,sweing,Wednesday,7,0.6,30.1,829,3360,23,0,0,1,58,0.600071
2/11/2015,Quarter2,finishing,Wednesday,9,0.8,3.94,?,960,0,0,0,0,8,0.54175
2/11/2015,Quarter2,sweing,Wednesday,3,0.8,22.52,11,6840,0,0,0,1,57,0.536902
2/11/2015,Quarter2,sweing,Wednesday,11,0.35,11.41,434,3240,0,0,0,1,52,0.507903
2/12/2015,Quarter2,sweing,Thursday,1,0.8,22.52,1397,0,138,0,0,0,57,1.100484
2/12/2015,Quarter2,finishing,Thursday,4,0.7,4.15,?,1800,0,0,0,0,15,1.096633
2/12/2015,Quarter2,sweing,Thursday,2,0.8,22.52,1327,0,113,0,0,0,57.5,1.000345
2/12/2015,Quarter2,finishing,Thursday,12,0.8,4.08,?,1080,0,0,0,0,9,0.838667
2/12/2015,Quarter2,sweing,Thursday,12,0.8,15.26,894,4080,50,0,0,0,34,0.800402
2/12/2015,Quarter2,finishing,Thursday,8,0.35,4.15,?,1440,0,0,0,0,12,0.755486
2/12/2015,Quarter2,sweing,Thursday,5,0.75,30.1,610,7080,56,0,0,0,59,0.750799
2/12/2015,Quarter2,sweing,Thursday,6,0.8,18.79,779,3960,0,0,0,0,33,0.688018
2/12/2015,Quarter2,finishing,Thursday,1,0.8,3.94,?,1440,0,0,0,0,12,0.664875
2/12/2015,Quarter2,finishing,Thursday,9,0.8,3.94,?,960,0,0,0,0,8,0.656667
2/12/2015,Quarter2,sweing,Thursday,4,0.7,30.1,419,7080,0,0,0,1,59,0.637712
2/12/2015,Quarter2,finishing,Thursday,2,0.8,3.94,?,2160,0,0,0,0,18,0.601944
2/12/2015,Quarter2,finishing,Thursday,5,0.7,4.15,?,240,0,0,0,0,2,0.58
2/12/2015,Quarter2,sweing,Thursday,7,0.65,30.1,909,7080,0,0,0,1,59,0.535678
2/12/2015,Quarter2,sweing,Thursday,11,0.5,11.41,1039,2280,0,0,0,2,55,0.500123
2/12/2015,Quarter2,sweing,Thursday,9,0.8,29.12,14,6960,0,0,0,0,58,0.497885
2/12/2015,Quarter2,sweing,Thursday,8,0.65,30.1,1193,7080,0,0,0,1,59,0.463404
2/12/2015,Quarter2,sweing,Thursday,10,0.8,22.52,10,6000,0,0,0,0,50,0.441392
2/12/2015,Quarter2,sweing,Thursday,3,0.35,30.1,770,6960,0,0,0,1,58,0.350302
2/14/2015,Quarter2,sweing,Saturday,1,0.8,22.52,1416,6840,113,0,0,0,57,1.00023
2/14/2015,Quarter2,finishing,Saturday,7,0.7,4.15,?,1800,0,0,0,0,15,0.929278
2/14/2015,Quarter2,finishing,Saturday,4,0.75,4.15,?,2400,0,0,0,0,20,0.902917
2/14/2015,Quarter2,finishing,Saturday,12,0.8,4.08,?,1080,0,0,0,0,9,0.800889
2/14/2015,Quarter2,sweing,Saturday,12,0.8,15.26,942,4080,63,0,0,0,34,0.800402
2/14/2015,Quarter2,sweing,Saturday,2,0.8,22.52,674,3660,63,0,0,0,57,0.800375
2/14/2015,Quarter2,finishing,Saturday,1,0.8,3.94,?,1440,0,0,0,0,12,0.796208
2/14/2015,Quarter2,sweing,Saturday,4,0.75,30.1,481,7140,0,0,0,1,59,0.750392
2/14/2015,Quarter2,sweing,Saturday,5,0.75,30.1,664,7140,56,0,0,0,59,0.750392
2/14/2015,Quarter2,finishing,Saturday,8,0.7,4.15,?,960,0,0,0,0,8,0.725625
2/14/2015,Quarter2,sweing,Saturday,8,0.7,30.1,824,5160,0,0,0,1,60,0.700206
2/14/2015,Quarter2,sweing,Saturday,7,0.7,30.1,957,7200,0,0,0,1,60,0.602
2/14/2015,Quarter2,sweing,Saturday,11,0.6,11.41,1039,2280,23,0,0,2,55,0.600448
2/14/2015,Quarter2,sweing,Saturday,6,0.8,18.79,822,4080,0,0,0,0,34,0.557252
2/14/2015,Quarter2,sweing,Saturday,3,0.5,30.1,1261,6960,30,0,0,1,58,0.500802
2/14/2015,Quarter2,finishing,Saturday,6,0.8,2.9,?,960,0,0,0,0,8,0.483333
2/14/2015,Quarter2,finishing,Saturday,9,0.8,3.94,?,960,0,0,0,0,8,0.238042
2/15/2015,Quarter3,finishing,Sunday,1,0.8,3.94,?,960,0,0,0,0,8,1.120437
2/15/2015,Quarter3,finishing,Sunday,2,0.8,3.94,?,960,0,0,0,0,8,1.108125
2/15/2015,Quarter3,sweing,Sunday,1,0.8,22.52,1420,6840,113,0,0,0,57,1.00023
2/15/2015,Quarter3,finishing,Sunday,12,0.8,4.08,?,1080,0,0,0,0,9,0.876444
2/15/2015,Quarter3,sweing,Sunday,12,0.8,15.26,1120,1440,50,0,0,0,34,0.800806
2/15/2015,Quarter3,finishing,Sunday,5,0.75,4.15,?,240,0,0,0,0,2,0.760833
2/15/2015,Quarter3,sweing,Sunday,5,0.8,30.1,679,7140,0,0,0,0,59.5,0.722569
2/15/2015,Quarter3,finishing,Sunday,11,0.6,2.9,?,1200,0,0,0,0,10,0.715333
2/15/2015,Quarter3,sweing,Sunday,7,0.7,30.1,881,7080,0,0,0,1,59,0.700633
2/15/2015,Quarter3,sweing,Sunday,8,0.7,30.1,507,5880,40,2,10,1,59,0.700573
2/15/2015,Quarter3,sweing,Sunday,6,0.75,18.79,814,4080,0,0,0,0,34,0.681598
2/15/2015,Quarter3,sweing,Sunday,11,0.65,11.41,700,2640,23,0,0,2,53,0.650224
2/15/2015,Quarter3,finishing,Sunday,8,0.7,4.15,?,960,0,0,0,0,8,0.605208
2/15/2015,Quarter3,finishing,Sunday,6,0.8,2.9,?,960,0,0,0,0,8,0.604167
2/15/2015,Quarter3,sweing,Sunday,4,0.75,30.1,919,7140,0,0,0,1,59.5,0.598627
2/15/2015,Quarter3,sweing,Sunday,3,0.6,30.1,1361,6960,30,0,0,1,58,0.475718
2/15/2015,Quarter3,sweing,Sunday,2,0.8,22.52,12,6900,0,0,0,0,57.5,0.432123
2/15/2015,Quarter3,finishing,Sunday,4,0.75,4.15,?,2400,0,0,0,0,20,0.287042
2/15/2015,Quarter3,sweing,Sunday,9,0.5,18.79,1688,5280,0,0,0,1,54,0.283054
2/16/2015,Quarter3,sweing,Monday,1,0.8,22.52,1422,6840,113,0,0,0,57,1.00023
2/16/2015,Quarter3,finishing,Monday,9,0.8,3.94,?,1200,0,0,0,0,10,0.960433
2/16/2015,Quarter3,finishing,Monday,12,0.8,4.08,?,1080,0,0,0,0,9,0.891556
2/16/2015,Quarter3,finishing,Monday,3,0.5,4.15,?,960,0,0,0,0,8,0.864583
2/16/2015,Quarter3,sweing,Monday,3,0.65,30.1,1263,600,63,0,0,1,58,0.802243
2/16/2015,Quarter3,sweing,Monday,5,0.8,30.1,461,0,0,0,0,0,59,0.80098
2/16/2015,Quarter3,sweing,Monday,12,0.8,15.26,1079,3720,38,0,0,0,34,0.800312
2/16/2015,Quarter3,finishing,Monday,6,0.8,2.9,?,960,0,0,0,0,8,0.773333
2/16/2015,Quarter3,sweing,Monday,6,0.75,18.79,895,3960,0,0,0,0,33,0.750651
2/16/2015,Quarter3,sweing,Monday,4,0.75,30.1,912,7020,0,0,0,1,58,0.750356
2/16/2015,Quarter3,finishing,Monday,4,0.75,4.15,?,1800,0,0,0,0,15,0.722333
2/16/2015,Quarter3,sweing,Monday,7,0.7,30.1,784,600,30,0,0,1,59,0.70046
2/16/2015,Quarter3,finishing,Monday,5,0.75,4.15,?,1200,0,0,0,0,10,0.629417
2/16/2015,Quarter3,sweing,Monday,8,0.7,30.1,7,7080,27,2,10,2,59,0.621972
2/16/2015,Quarter3,sweing,Monday,11,0.7,11.41,680,2160,30,0,0,2,54,0.565972
2/16/2015,Quarter3,sweing,Monday,10,0.6,18.22,1131,5280,0,0,0,1,44,0.355428
2/16/2015,Quarter3,sweing,Monday,9,0.6,18.79,2103,5400,0,0,0,1,54,0.329965
2/16/2015,Quarter3,finishing,Monday,7,0.7,4.15,?,1800,0,0,0,0,15,0.258
2/17/2015,Quarter3,sweing,Tuesday,1,0.8,22.52,1445,6840,113,0,0,0,57,1.00023
2/17/2015,Quarter3,finishing,Tuesday,10,0.8,3.94,?,960,0,0,0,0,8,0.927542
2/17/2015,Quarter3,finishing,Tuesday,7,0.7,5.13,?,1200,0,0,0,0,10,0.91375
2/17/2015,Quarter3,finishing,Tuesday,12,0.8,5.13,?,1080,0,0,0,0,9,0.9025
2/17/2015,Quarter3,sweing,Tuesday,12,0.8,15.26,1133,4080,38,0,0,0,34,0.800402
2/17/2015,Quarter3,finishing,Tuesday,3,0.5,5.13,?,1800,0,0,0,0,15,0.7866
2/17/2015,Quarter3,sweing,Tuesday,6,0.75,18.79,726,3360,0,0,0,0,33,0.750621
2/17/2015,Quarter3,sweing,Tuesday,4,0.75,30.1,849,7020,45,0,0,1,58,0.750356
2/17/2015,Quarter3,finishing,Tuesday,6,0.8,2.9,?,960,0,0,0,0,8,0.749167
2/17/2015,Quarter3,sweing,Tuesday,7,0.7,30.1,562,840,30,0,0,1,59,0.700888
2/17/2015,Quarter3,sweing,Tuesday,11,0.7,11.41,1054,3420,30,0,0,2,56,0.700614
2/17/2015,Quarter3,sweing,Tuesday,3,0.7,30.1,1422,6960,50,0,0,1,58,0.700603
2/17/2015,Quarter3,finishing,Tuesday,4,0.75,5.13,?,960,0,0,0,0,8,0.656667
2/17/2015,Quarter3,sweing,Tuesday,5,0.8,30.1,680,7140,0,0,0,0,59,0.653431
2/17/2015,Quarter3,sweing,Tuesday,9,0.65,18.79,2120,5520,0,0,0,1,51,0.650134
2/17/2015,Quarter3,sweing,Tuesday,8,0.6,29.4,179,0,23,5,30,2,58,0.600983
2/17/2015,Quarter3,finishing,Tuesday,9,0.8,3.94,?,960,0,0,0,0,8,0.586042
2/17/2015,Quarter3,finishing,Tuesday,2,0.8,5.13,?,1800,0,0,0,0,15,0.5814
2/17/2015,Quarter3,sweing,Tuesday,2,0.5,30.33,838,6720,0,0,0,1,56,0.361071
2/17/2015,Quarter3,sweing,Tuesday,10,0.65,18.22,741,0,0,8,35,1,49,0.302117
2/18/2015,Quarter3,finishing,Wednesday,12,0.8,5.13,?,1200,0,0,0,0,10,0.9918
2/18/2015,Quarter3,finishing,Wednesday,6,0.8,2.9,?,1440,0,0,0,0,12,0.936861
2/18/2015,Quarter3,finishing,Wednesday,2,0.8,5.13,?,1440,0,0,0,0,12,0.919125
2/18/2015,Quarter3,sweing,Wednesday,11,0.7,11.41,685,3360,30,0,0,2,56,0.821113
2/18/2015,Quarter3,sweing,Wednesday,4,0.8,30.1,864,480,50,0,0,1,58,0.80098
2/18/2015,Quarter3,sweing,Wednesday,5,0.8,30.1,511,0,0,0,0,0,59,0.80098
2/18/2015,Quarter3,sweing,Wednesday,12,0.8,15.26,1095,4080,63,0,0,0,34,0.800402
2/18/2015,Quarter3,sweing,Wednesday,1,0.8,22.52,1374,3960,63,0,0,0,57,0.80028
2/18/2015,Quarter3,sweing,Wednesday,6,0.75,18.79,759,3960,34,0,0,0,33,0.750651
2/18/2015,Quarter3,sweing,Wednesday,7,0.75,30.1,553,2280,45,0,0,1,59,0.750533
2/18/2015,Quarter3,finishing,Wednesday,4,0.75,5.13,?,960,0,0,0,0,8,0.734646
2/18/2015,Quarter3,sweing,Wednesday,3,0.7,30.1,1057,0,40,0,0,1,58,0.700603
2/18/2015,Quarter3,sweing,Wednesday,9,0.7,18.79,1587,4560,30,0,0,1,51,0.700096
2/18/2015,Quarter3,finishing,Wednesday,7,0.7,5.13,?,960,0,0,0,0,8,0.671875
2/18/2015,Quarter3,finishing,Wednesday,10,0.8,3.94,?,960,0,0,0,0,8,0.64025
2/18/2015,Quarter3,finishing,Wednesday,8,0.7,5.13,?,960,0,0,0,0,8,0.58
2/18/2015,Quarter3,finishing,Wednesday,9,0.8,3.94,?,960,0,0,0,0,8,0.549792
2/18/2015,Quarter3,sweing,Wednesday,2,0.6,30.33,868,6840,0,0,0,1,57,0.328132
2/18/2015,Quarter3,sweing,Wednesday,10,0.7,19.68,1119,5640,0,8,35,1,47,0.303574
2/18/2015,Quarter3,finishing,Wednesday,3,0.5,5.13,?,960,0,0,0,0,8,0.2565
2/18/2015,Quarter3,sweing,Wednesday,8,0.65,29.4,962,4560,0,4.5,30,2,57,0.251399
2/19/2015,Quarter3,finishing,Thursday,3,0.5,5.13,?,2880,0,0,0,0,12,0.816406
2/19/2015,Quarter3,sweing,Thursday,12,0.8,15.26,1126,1080,38,0,0,0,34,0.800711
2/19/2015,Quarter3,sweing,Thursday,1,0.8,22.52,265,3840,63,0,0,0,57,0.800471
2/19/2015,Quarter3,sweing,Thursday,4,0.8,30.1,859,7020,63,0,0,1,58.5,0.800094
2/19/2015,Quarter3,sweing,Thursday,5,0.8,30.1,276,600,63,3.5,15,0,59.5,0.799983
2/19/2015,Quarter3,finishing,Thursday,6,0.8,2.9,?,4320,0,0,0,0,18,0.785864
2/19/2015,Quarter3,sweing,Thursday,6,0.75,18.79,899,3960,56,0,0,0,33,0.750651
2/19/2015,Quarter3,finishing,Thursday,10,0.8,3.94,?,2400,0,0,0,0,10,0.733278
2/19/2015,Quarter3,finishing,Thursday,2,0.8,5.13,?,3600,0,0,0,0,15,0.710125
2/19/2015,Quarter3,sweing,Thursday,3,0.7,30.1,247,6960,50,0,0,1,58,0.700603
2/19/2015,Quarter3,sweing,Thursday,11,0.7,11.41,653,3480,30,0,0,2,58,0.70054
2/19/2015,Quarter3,sweing,Thursday,8,0.7,29.4,1116,6240,0,0,0,2,57,0.7
2/19/2015,Quarter3,finishing,Thursday,4,0.75,5.13,?,1920,0,0,0,0,8,0.684028
2/19/2015,Quarter3,finishing,Thursday,8,0.7,5.13,?,1920,0,0,0,0,8,0.672135
2/19/2015,Quarter3,sweing,Thursday,9,0.7,18.79,1603,6120,30,0,0,1,51,0.638614
2/19/2015,Quarter3,finishing,Thursday,5,0.75,5.13,?,1920,0,0,0,0,8,0.631354
2/19/2015,Quarter3,sweing,Thursday,7,0.75,30.1,444,0,0,5,20,1,59,0.611141
2/19/2015,Quarter3,finishing,Thursday,12,0.8,5.13,?,2160,0,0,0,0,9,0.609583
2/19/2015,Quarter3,sweing,Thursday,2,0.65,30.33,841,6840,0,0,0,1,57,0.585316
2/19/2015,Quarter3,sweing,Thursday,10,0.7,19.68,1410,5760,0,0,0,1,48,0.249417
2/22/2015,Quarter4,finishing,Sunday,3,0.5,5.13,?,1800,0,0,0,0,15,0.8721
2/22/2015,Quarter4,finishing,Sunday,6,0.8,2.9,?,960,0,0,0,0,8,0.831937
2/22/2015,Quarter4,finishing,Sunday,2,0.8,5.13,?,4800,0,0,0,0,20,0.830063
2/22/2015,Quarter4,finishing,Sunday,11,0.6,2.9,?,2880,0,0,0,0,12,0.805556
2/22/2015,Quarter4,sweing,Sunday,12,0.8,15.26,1103,4080,63,0,0,0,34,0.800402
2/22/2015,Quarter4,sweing,Sunday,4,0.8,30.1,922,5820,63,0,0,1,59,0.800003
2/22/2015,Quarter4,finishing,Sunday,12,0.8,5.13,?,2400,0,0,0,0,10,0.78375
2/22/2015,Quarter4,finishing,Sunday,9,0.8,3.94,?,2400,0,0,0,0,10,0.753525
2/22/2015,Quarter4,sweing,Sunday,6,0.75,18.79,1055,3960,45,0,0,0,33,0.750651
2/22/2015,Quarter4,finishing,Sunday,1,0.8,3.94,?,2880,0,0,0,0,12,0.72735
2/22/2015,Quarter4,sweing,Sunday,8,0.7,29.4,1146,6840,40,0,0,2,57,0.700614
2/22/2015,Quarter4,sweing,Sunday,2,0.7,30.33,746,6840,0,0,0,1,57,0.700605
2/22/2015,Quarter4,sweing,Sunday,11,0.75,11.41,834,3480,0,0,0,2,58,0.672141
2/22/2015,Quarter4,sweing,Sunday,9,0.7,18.79,1717,3240,30,0,0,1,57,0.627011
2/22/2015,Quarter4,sweing,Sunday,3,0.7,30.1,1041,8160,33,0,0,2,58,0.626578
2/22/2015,Quarter4,sweing,Sunday,10,0.7,21.25,1531,6000,0,0,0,1,50,0.456875
2/22/2015,Quarter4,sweing,Sunday,7,0.75,30.1,627,6960,0,3.5,20,1,58,0.393549
2/22/2015,Quarter4,finishing,Sunday,10,0.8,3.94,?,960,0,0,0,0,8,0.385792
2/22/2015,Quarter4,sweing,Sunday,5,0.8,30.1,450,5700,0,4.5,25,0,60,0.307501
2/22/2015,Quarter4,finishing,Sunday,7,0.7,5.13,?,960,0,0,0,0,8,0.283958
2/23/2015,Quarter4,finishing,Monday,10,0.8,3.94,?,2400,0,0,0,0,20,0.955792
2/23/2015,Quarter4,finishing,Monday,8,0.7,5.13,?,960,0,0,0,0,8,0.930417
2/23/2015,Quarter4,finishing,Monday,12,0.8,5.13,?,1080,0,0,0,0,9,0.9025
2/23/2015,Quarter4,finishing,Monday,3,0.8,5.13,?,2160,0,0,0,0,18,0.87115
2/23/2015,Quarter4,sweing,Monday,12,0.8,15.26,1060,4080,63,0,0,0,34,0.800402
2/23/2015,Quarter4,sweing,Monday,4,0.8,30.1,891,7140,38,0,0,1,59,0.800137
2/23/2015,Quarter4,sweing,Monday,5,0.8,30.1,541,7140,38,0,0,0,59,0.800137
2/23/2015,Quarter4,sweing,Monday,7,0.75,30.1,709,6960,45,0,0,1,58,0.75077
2/23/2015,Quarter4,sweing,Monday,6,0.75,18.79,1100,3960,45,0,0,0,33,0.750651
2/23/2015,Quarter4,sweing,Monday,11,0.75,11.41,826,2820,0,0,0,2,58,0.750294
2/23/2015,Quarter4,sweing,Monday,2,0.7,30.33,577,2160,30,0,0,1,58,0.700623
2/23/2015,Quarter4,sweing,Monday,8,0.7,29.4,1094,6840,40,0,0,2,57,0.700614
2/23/2015,Quarter4,sweing,Monday,3,0.7,29.4,1228,6960,30,0,0,2,58,0.700362
2/23/2015,Quarter4,sweing,Monday,9,0.7,18.79,1641,6000,40,0,0,1,50,0.60128
2/23/2015,Quarter4,sweing,Monday,10,0.7,21.25,1583,6000,0,0,0,1,50,0.417917
2/23/2015,Quarter4,finishing,Monday,6,0.8,2.9,?,960,0,0,0,0,8,0.371563
2/23/2015,Quarter4,finishing,Monday,9,0.8,2.9,?,960,0,0,0,0,8,0.371563
2/23/2015,Quarter4,finishing,Monday,2,0.8,5.13,?,960,0,0,0,0,8,0.368719
2/23/2015,Quarter4,finishing,Monday,7,0.7,5.13,?,960,0,0,0,0,8,0.356458
2/24/2015,Quarter4,finishing,Tuesday,10,0.7,2.9,?,1800,0,0,0,0,15,0.902222
2/24/2015,Quarter4,finishing,Tuesday,3,0.8,4.6,?,1440,0,0,0,0,12,0.811389
2/24/2015,Quarter4,sweing,Tuesday,12,0.8,15.26,1062,4080,50,0,0,0,34,0.800402
2/24/2015,Quarter4,sweing,Tuesday,5,0.8,30.1,450,7140,50,0,0,0,60,0.800137
2/24/2015,Quarter4,sweing,Tuesday,4,0.8,30.1,901,6480,50,0,0,1,59,0.800072
2/24/2015,Quarter4,finishing,Tuesday,8,0.7,4.6,?,960,0,0,0,0,8,0.791458
2/24/2015,Quarter4,sweing,Tuesday,7,0.75,30.1,739,5640,45,0,0,1,59,0.750727
2/24/2015,Quarter4,sweing,Tuesday,6,0.75,18.79,913,3360,45,0,0,0,33,0.750651
2/24/2015,Quarter4,sweing,Tuesday,11,0.75,11.61,698,3360,34,0,0,2,57,0.750437
2/24/2015,Quarter4,sweing,Tuesday,3,0.75,29.4,1172,5340,45,0,0,2,60,0.750177
2/24/2015,Quarter4,finishing,Tuesday,6,0.75,2.9,?,1800,0,0,0,0,15,0.726933
2/24/2015,Quarter4,finishing,Tuesday,9,0.7,2.9,?,1800,0,0,0,0,15,0.726933
2/24/2015,Quarter4,sweing,Tuesday,2,0.7,30.33,408,1680,30,0,0,1,59,0.700623
2/24/2015,Quarter4,sweing,Tuesday,8,0.7,29.4,1079,4560,40,0,0,2,58,0.700519
2/24/2015,Quarter4,sweing,Tuesday,9,0.7,18.79,1068,3000,30,0,0,1,52,0.700257
2/24/2015,Quarter4,finishing,Tuesday,11,0.7,2.9,?,960,0,0,0,0,8,0.504687
2/24/2015,Quarter4,sweing,Tuesday,10,0.7,21.25,1834,6360,0,0,0,1,53,0.471108
2/24/2015,Quarter4,finishing,Tuesday,2,0.7,3.9,?,960,0,0,0,0,8,0.325
2/24/2015,Quarter4,sweing,Tuesday,1,0.6,22.53,708,5040,0,0,0,1,42,0.268214
2/25/2015,Quarter4,sweing,Wednesday,9,0.75,18.79,1085,6240,56,0,0,1,52,0.970817
2/25/2015,Quarter4,finishing,Wednesday,5,0.8,4.6,?,1080,0,0,0,0,9,0.902963
2/25/2015,Quarter4,finishing,Wednesday,3,0.8,4.6,?,2400,0,0,0,0,20,0.900833
2/25/2015,Quarter4,finishing,Wednesday,12,0.8,4.6,?,1800,0,0,0,0,15,0.899556
2/25/2015,Quarter4,finishing,Wednesday,10,0.7,2.9,?,1200,0,0,0,0,10,0.845833
2/25/2015,Quarter4,sweing,Wednesday,4,0.8,30.1,323,4080,50,0,0,1,59,0.800809
2/25/2015,Quarter4,sweing,Wednesday,12,0.8,15.26,1053,4080,50,0,0,0,34,0.800402
2/25/2015,Quarter4,sweing,Wednesday,7,0.8,30.1,786,7080,50,0,0,2,59,0.800116
2/25/2015,Quarter4,sweing,Wednesday,6,0.75,18.79,1003,3960,45,0,0,1,33,0.750651
2/25/2015,Quarter4,sweing,Wednesday,11,0.75,11.61,635,3360,45,0,0,0,57,0.750504
2/25/2015,Quarter4,sweing,Wednesday,3,0.75,29.4,1283,6960,45,0,0,2,58,0.750207
2/25/2015,Quarter4,sweing,Wednesday,8,0.7,29.4,847,6960,30,0,0,1,58,0.700362
2/25/2015,Quarter4,sweing,Wednesday,2,0.7,30.33,361,3960,30,0,0,1,58,0.70007
2/25/2015,Quarter4,sweing,Wednesday,10,0.7,21.82,1653,6240,0,0,0,2,52,0.700058
2/25/2015,Quarter4,finishing,Wednesday,7,0.75,4.6,?,960,0,0,0,0,8,0.676667
2/25/2015,Quarter4,finishing,Wednesday,8,0.7,4.6,?,960,0,0,0,0,8,0.658542
2/25/2015,Quarter4,sweing,Wednesday,5,0.8,30.1,15,1200,49,0,0,1,59,0.598792
2/25/2015,Quarter4,sweing,Wednesday,1,0.65,22.53,762,5040,0,0,0,1,42,0.581131
2/25/2015,Quarter4,finishing,Wednesday,2,0.7,3.9,?,960,0,0,0,0,8,0.440375
2/25/2015,Quarter4,finishing,Wednesday,6,0.75,2.9,?,960,0,0,0,0,8,0.410833
2/25/2015,Quarter4,finishing,Wednesday,9,0.7,2.9,?,960,0,0,0,0,8,0.410833
2/26/2015,Quarter4,finishing,Thursday,3,0.8,4.6,?,6300,0,0,0,0,15,0.921704
2/26/2015,Quarter4,finishing,Thursday,5,0.8,4.6,?,7560,0,0,0,0,18,0.921605
2/26/2015,Quarter4,sweing,Thursday,7,0.8,30.1,694,4080,50,0,0,1,59,0.800809
2/26/2015,Quarter4,sweing,Thursday,11,0.8,11.61,816,2820,50,0,0,2,57,0.800517
2/26/2015,Quarter4,sweing,Thursday,12,0.8,15.26,1065,4080,63,0,0,0,34,0.800402
2/26/2015,Quarter4,finishing,Thursday,1,0.5,3.94,?,3360,0,0,0,0,8,0.768847
2/26/2015,Quarter4,sweing,Thursday,6,0.75,18.79,912,3960,45,0,0,0,33,0.750651
2/26/2015,Quarter4,sweing,Thursday,3,0.75,29.4,1244,6840,45,0,0,2,57,0.750474
2/26/2015,Quarter4,sweing,Thursday,9,0.75,18.79,1020,5640,45,0,0,1,52,0.750372
2/26/2015,Quarter4,sweing,Thursday,8,0.75,29.4,916,6960,56,0,0,2,58,0.750207
2/26/2015,Quarter4,sweing,Thursday,10,0.7,21.82,1591,3240,0,0,0,1,52,0.700252
2/26/2015,Quarter4,sweing,Thursday,2,0.7,30.33,398,6960,0,0,0,1,58,0.662379
2/26/2015,Quarter4,finishing,Thursday,12,0.8,4.6,?,3780,0,0,0,0,9,0.590617
2/26/2015,Quarter4,finishing,Thursday,2,0.7,3.9,?,960,0,0,0,0,8,0.556562
2/26/2015,Quarter4,sweing,Thursday,4,0.8,30.1,437,7080,32,0,0,2,59,0.495618
2/26/2015,Quarter4,sweing,Thursday,5,0.35,27.48,413,6840,38,0,0,1,57,0.449965
2/26/2015,Quarter4,finishing,Thursday,10,0.7,2.9,?,3360,0,0,0,0,8,0.410833
2/26/2015,Quarter4,finishing,Thursday,9,0.75,2.9,?,960,0,0,0,0,8,0.407813
2/26/2015,Quarter4,sweing,Thursday,1,0.35,26.66,1164,6600,23,0,0,2,55,0.378895
2/26/2015,Quarter4,finishing,Thursday,8,0.75,4.6,?,3360,0,0,0,0,8,0.376597
2/26/2015,Quarter4,finishing,Thursday,6,0.75,2.9,?,3360,0,0,0,0,8,0.271875
2/28/2015,Quarter4,finishing,Saturday,3,0.8,4.6,?,6300,0,0,0,0,15,0.921704
2/28/2015,Quarter4,finishing,Saturday,5,0.8,4.6,?,7560,0,0,0,0,18,0.921605
2/28/2015,Quarter4,sweing,Saturday,11,0.8,11.61,954,0,50,0,0,2,58,0.800779
2/28/2015,Quarter4,sweing,Saturday,12,0.8,15.26,1194,1700,62,0,0,0,34,0.800261
2/28/2015,Quarter4,sweing,Saturday,7,0.8,30.1,644,840,38,0,0,1,59,0.799983
2/28/2015,Quarter4,finishing,Saturday,1,0.5,3.94,?,3360,0,0,0,0,8,0.768847
2/28/2015,Quarter4,sweing,Saturday,3,0.75,29.4,1144,4440,45,0,0,2,57,0.750717
2/28/2015,Quarter4,sweing,Saturday,6,0.75,18.79,1012,3960,45,0,0,0,33,0.750651
2/28/2015,Quarter4,sweing,Saturday,8,0.75,29.4,792,4560,56,0,0,2,58,0.750426
2/28/2015,Quarter4,sweing,Saturday,9,0.75,18.79,841,6240,45,0,0,1,52,0.750396
2/28/2015,Quarter4,sweing,Saturday,10,0.7,21.82,1448,6120,40,0,0,1,51,0.700237
2/28/2015,Quarter4,sweing,Saturday,2,0.7,30.33,512,4560,0,0,0,1,58,0.700211
2/28/2015,Quarter4,finishing,Saturday,12,0.8,4.6,?,3780,0,0,0,0,9,0.590617
2/28/2015,Quarter4,finishing,Saturday,2,0.7,3.9,?,960,0,0,0,0,8,0.556562
2/28/2015,Quarter4,sweing,Saturday,5,0.5,27.48,609,6840,30,0,0,1,57,0.550404
2/28/2015,Quarter4,sweing,Saturday,1,0.5,26.66,1448,6840,30,0,0,2,57,0.55035
2/28/2015,Quarter4,sweing,Saturday,4,0.5,26.66,556,6960,23,0,0,2,58,0.500258
2/28/2015,Quarter4,finishing,Saturday,10,0.7,2.9,?,3360,0,0,0,0,8,0.410833
2/28/2015,Quarter4,finishing,Saturday,9,0.75,2.9,?,960,0,0,0,0,8,0.407813
2/28/2015,Quarter4,finishing,Saturday,8,0.75,4.6,?,3360,0,0,0,0,8,0.376597
2/28/2015,Quarter4,finishing,Saturday,6,0.75,2.9,?,3360,0,0,0,0,8,0.271875
3/1/2015,Quarter1,finishing,Sunday,3,0.8,4.6,?,10500,0,0,0,0,25,0.936356
3/1/2015,Quarter1,finishing,Sunday,8,0.75,4.6,?,3360,0,0,0,0,8,0.813611
3/1/2015,Quarter1,sweing,Sunday,12,0.8,15.26,1106,4080,63,0,0,0,34,0.800402
3/1/2015,Quarter1,sweing,Sunday,8,0.75,29.4,622,6240,56,0,0,0,57,0.75075
3/1/2015,Quarter1,sweing,Sunday,6,0.75,18.79,1193,3960,45,0,0,0,33,0.750651
3/1/2015,Quarter1,sweing,Sunday,3,0.75,29.4,1143,6840,45,0,0,0,57,0.750474
3/1/2015,Quarter1,sweing,Sunday,9,0.75,18.79,895,6240,34,0,0,0,52,0.750396
3/1/2015,Quarter1,sweing,Sunday,5,0.6,27.48,549,6720,38,0,0,0,56,0.707446
3/1/2015,Quarter1,sweing,Sunday,10,0.7,21.82,1393,5640,30,0,0,0,52,0.700237
3/1/2015,Quarter1,sweing,Sunday,1,0.6,26.66,1578,6840,38,0,0,0,57,0.70002
3/1/2015,Quarter1,sweing,Sunday,2,0.7,30.33,254,1800,0,0,0,0,58,0.683551
3/1/2015,Quarter1,sweing,Sunday,11,0.8,11.61,347,0,50,4,20,0,57,0.682433
3/1/2015,Quarter1,finishing,Sunday,4,0.6,3.94,?,960,0,0,0,0,8,0.673083
3/1/2015,Quarter1,finishing,Sunday,10,0.7,2.9,?,3360,0,0,0,0,8,0.664583
3/1/2015,Quarter1,sweing,Sunday,4,0.6,26.66,692,6840,23,0,0,0,57,0.60024
3/1/2015,Quarter1,finishing,Sunday,2,0.7,3.9,?,960,0,0,0,0,8,0.585
3/1/2015,Quarter1,sweing,Sunday,7,0.8,30.1,934,6960,0,3.5,15,0,58,0.579511
3/1/2015,Quarter1,finishing,Sunday,1,0.6,3.94,?,3360,0,0,0,0,8,0.448722
3/1/2015,Quarter1,finishing,Sunday,9,0.75,2.9,?,960,0,0,0,0,8,0.447083
3/1/2015,Quarter1,finishing,Sunday,7,0.8,4.6,?,3360,0,0,0,0,8,0.350417
3/2/2015,Quarter1,finishing,Monday,2,0.7,3.9,?,1200,0,0,0,0,10,0.92885
3/2/2015,Quarter1,finishing,Monday,3,0.8,4.6,?,10080,0,0,0,0,24,0.86037
3/2/2015,Quarter1,finishing,Monday,4,0.65,3.94,?,960,0,0,0,0,8,0.806879
3/2/2015,Quarter1,sweing,Monday,1,0.65,26.66,1527,6840,65,0,0,0,57,0.80058
3/2/2015,Quarter1,sweing,Monday,12,0.8,15.26,1035,4080,63,0,0,0,34,0.800402
3/2/2015,Quarter1,finishing,Monday,9,0.75,2.9,?,1200,0,0,0,0,10,0.8004
3/2/2015,Quarter1,sweing,Monday,11,0.8,11.61,632,0,50,0,0,0,57,0.800309
3/2/2015,Quarter1,sweing,Monday,3,0.8,29.4,1231,4680,50,0,0,0,57,0.80015
3/2/2015,Quarter1,sweing,Monday,7,0.8,30.1,616,7080,0,0,0,0,59,0.800116
3/2/2015,Quarter1,finishing,Monday,8,0.75,4.6,?,3360,0,0,0,0,8,0.773333
3/2/2015,Quarter1,sweing,Monday,6,0.75,18.79,947,2880,34,0,0,0,33,0.750797
3/2/2015,Quarter1,sweing,Monday,8,0.75,29.4,551,6840,45,0,0,0,57,0.750474
3/2/2015,Quarter1,sweing,Monday,9,0.75,18.79,935,6240,45,0,0,0,52,0.750396
3/2/2015,Quarter1,sweing,Monday,4,0.65,26.66,832,6780,55,0,0,0,57,0.750255
3/2/2015,Quarter1,sweing,Monday,5,0.65,27.48,544,6720,34,0,0,0,56,0.700904
3/2/2015,Quarter1,sweing,Monday,10,0.7,21.82,1511,3600,30,0,0,0,51,0.700136
3/2/2015,Quarter1,finishing,Monday,10,0.7,2.9,?,3360,0,0,0,0,8,0.632361
3/2/2015,Quarter1,finishing,Monday,12,0.8,4.6,?,3780,0,0,0,0,9,0.607654
3/2/2015,Quarter1,finishing,Monday,1,0.65,3.94,?,3360,0,0,0,0,8,0.537919
3/2/2015,Quarter1,finishing,Monday,7,0.8,4.6,?,3360,0,0,0,0,8,0.342361
3/3/2015,Quarter1,finishing,Tuesday,7,0.8,4.6,?,4200,0,0,0,0,10,0.999533
3/3/2015,Quarter1,finishing,Tuesday,3,0.8,4.6,?,6300,0,0,0,0,15,0.902963
3/3/2015,Quarter1,sweing,Tuesday,11,0.8,11.41,601,0,50,0,0,0,56,0.800702
3/3/2015,Quarter1,sweing,Tuesday,1,0.7,26.66,1562,6960,60,0,0,0,58,0.800566
3/3/2015,Quarter1,sweing,Tuesday,12,0.8,15.26,983,4080,50,0,0,0,34,0.800402
3/3/2015,Quarter1,sweing,Tuesday,3,0.8,29.4,1156,6840,50,0,0,0,57,0.800333
3/3/2015,Quarter1,sweing,Tuesday,7,0.8,30.1,29,7080,50,0,0,0,59,0.800116
3/3/2015,Quarter1,sweing,Tuesday,4,0.7,26.66,950,6960,50,0,0,0,58,0.75077
3/3/2015,Quarter1,sweing,Tuesday,8,0.75,29.4,534,6840,56,0,0,0,57,0.750474
3/3/2015,Quarter1,sweing,Tuesday,9,0.75,18.79,1096,6240,34,0,0,0,52,0.750396
3/3/2015,Quarter1,sweing,Tuesday,6,0.75,20.2,402,3120,45,0,0,0,33,0.750213
3/3/2015,Quarter1,finishing,Tuesday,8,0.75,4.6,?,3360,0,0,0,0,8,0.702778
3/3/2015,Quarter1,sweing,Tuesday,5,0.7,27.48,573,6840,30,0,0,0,57,0.70066
3/3/2015,Quarter1,sweing,Tuesday,10,0.7,21.82,1313,5040,30,0,0,0,51,0.699984
3/3/2015,Quarter1,finishing,Tuesday,12,0.8,4.6,?,3780,0,0,0,0,9,0.636049
3/3/2015,Quarter1,finishing,Tuesday,2,0.4,3.9,?,6300,0,0,0,0,15,0.567378
3/3/2015,Quarter1,finishing,Tuesday,1,0.7,3.94,?,3360,0,0,0,0,8,0.555431
3/3/2015,Quarter1,finishing,Tuesday,4,0.7,3.94,?,3360,0,0,0,0,8,0.555431
3/3/2015,Quarter1,finishing,Tuesday,10,0.7,2.9,?,3360,0,0,0,0,8,0.463194
3/3/2015,Quarter1,finishing,Tuesday,5,0.7,4.6,?,3360,0,0,0,0,8,0.354444
3/3/2015,Quarter1,finishing,Tuesday,6,0.75,2.9,?,3360,0,0,0,0,8,0.309333
3/3/2015,Quarter1,sweing,Tuesday,2,0.4,15.28,157,5400,0,6.5,30,1,45,0.30277
3/4/2015,Quarter1,finishing,Wednesday,3,0.8,4.6,?,1200,0,0,0,0,10,0.939167
3/4/2015,Quarter1,finishing,Wednesday,8,0.8,4.6,?,960,0,0,0,0,8,0.930417
3/4/2015,Quarter1,finishing,Wednesday,12,0.8,4.6,?,1080,0,0,0,0,9,0.885926
3/4/2015,Quarter1,finishing,Wednesday,9,0.75,2.9,?,960,0,0,0,0,8,0.83375
3/4/2015,Quarter1,finishing,Wednesday,1,0.7,3.94,?,960,0,0,0,0,8,0.806879
3/4/2015,Quarter1,finishing,Wednesday,4,0.7,3.94,?,960,0,0,0,0,8,0.806058
3/4/2015,Quarter1,sweing,Wednesday,11,0.8,11.41,433,0,38,0,0,0,56,0.800702
3/4/2015,Quarter1,sweing,Wednesday,12,0.8,15.26,961,4080,50,0,0,0,34,0.800402
3/4/2015,Quarter1,sweing,Wednesday,3,0.8,29.4,1169,6840,63,0,0,0,57,0.800333
3/4/2015,Quarter1,sweing,Wednesday,7,0.8,30.1,874,3960,50,0,0,0,59,0.800056
3/4/2015,Quarter1,sweing,Wednesday,4,0.7,26.82,1028,6960,60,0,0,0,58,0.799976
3/4/2015,Quarter1,sweing,Wednesday,1,0.7,26.82,1772,6960,50,0,0,0,58,0.750652
3/4/2015,Quarter1,sweing,Wednesday,9,0.75,18.79,1206,6240,34,0,0,0,52,0.750396
3/4/2015,Quarter1,sweing,Wednesday,5,0.7,27.48,586,6960,40,0,0,0,58,0.700424
3/4/2015,Quarter1,sweing,Wednesday,10,0.7,21.82,1334,5760,30,0,0,0,53,0.700058
3/4/2015,Quarter1,finishing,Wednesday,7,0.8,4.6,?,8400,0,0,0,0,20,0.684889
3/4/2015,Quarter1,finishing,Wednesday,5,0.7,4.6,?,960,0,0,0,0,8,0.592083
3/4/2015,Quarter1,finishing,Wednesday,2,0.5,3.9,?,960,0,0,0,0,8,0.540312
3/4/2015,Quarter1,sweing,Wednesday,8,0.8,29.4,30,6840,0,0,0,0,57,0.433263
3/4/2015,Quarter1,sweing,Wednesday,2,0.5,15.28,261,5520,0,0,0,1,46,0.404145
3/4/2015,Quarter1,sweing,Wednesday,6,0.75,18.79,52,3960,0,0,0,0,33,0.332146
3/5/2015,Quarter1,finishing,Thursday,8,0.8,4.6,?,2640,0,0,0,0,22,0.980985
3/5/2015,Quarter1,finishing,Thursday,2,0.6,3.9,?,960,0,0,0,0,8,0.950625
3/5/2015,Quarter1,finishing,Thursday,11,0.8,2.9,?,1200,0,0,0,0,10,0.927292
3/5/2015,Quarter1,finishing,Thursday,12,0.8,4.6,?,1080,0,0,0,0,9,0.868889
3/5/2015,Quarter1,finishing,Thursday,1,0.7,3.94,?,960,0,0,0,0,8,0.812625
3/5/2015,Quarter1,finishing,Thursday,4,0.7,3.94,?,960,0,0,0,0,8,0.812625
3/5/2015,Quarter1,finishing,Thursday,3,0.8,4.6,?,1800,0,0,0,0,15,0.810111
3/5/2015,Quarter1,sweing,Thursday,11,0.8,11.41,455,3420,50,0,0,0,56,0.800702
3/5/2015,Quarter1,sweing,Thursday,3,0.8,29.4,797,1800,63,0,0,0,57,0.800535
3/5/2015,Quarter1,sweing,Thursday,12,0.8,15.26,959,4080,50,0,0,0,34,0.800402
3/5/2015,Quarter1,sweing,Thursday,1,0.7,26.82,1373,6960,50,0,0,0,58,0.750652
3/5/2015,Quarter1,sweing,Thursday,9,0.75,18.79,1228,6240,45,0,0,0,52,0.750396
3/5/2015,Quarter1,sweing,Thursday,4,0.7,26.82,1117,7080,50,0,0,0,59,0.750051
3/5/2015,Quarter1,sweing,Thursday,5,0.7,27.48,230,6960,40,0,0,0,58,0.700424
3/5/2015,Quarter1,sweing,Thursday,10,0.7,21.82,1390,6000,30,0,0,0,50,0.700422
3/5/2015,Quarter1,sweing,Thursday,2,0.6,15.28,529,1320,0,0,0,1,46,0.600099
3/5/2015,Quarter1,finishing,Thursday,9,0.75,2.9,?,960,0,0,0,0,8,0.453125
3/5/2015,Quarter1,sweing,Thursday,7,0.8,30.1,834,1200,0,4,40,0,59,0.366054
3/5/2015,Quarter1,sweing,Thursday,6,0.35,22.53,1450,2640,0,0,0,1,39,0.263694
3/7/2015,Quarter1,finishing,Saturday,12,0.8,4.6,?,1080,0,0,0,0,9,0.868889
3/7/2015,Quarter1,sweing,Saturday,12,0.8,15.26,986,4080,75,0,0,0,34,0.850521
3/7/2015,Quarter1,sweing,Saturday,1,0.7,26.82,1267,8160,70,0,0,0,58,0.850045
3/7/2015,Quarter1,finishing,Saturday,7,0.8,4.6,?,6000,0,0,0,0,25,0.825444
3/7/2015,Quarter1,finishing,Saturday,5,0.35,3.94,?,2400,0,0,0,0,10,0.80575
3/7/2015,Quarter1,sweing,Saturday,4,0.7,26.82,1195,6960,60,0,0,0,58,0.800747
3/7/2015,Quarter1,sweing,Saturday,3,0.8,29.4,983,6840,63,0,0,1,57,0.800579
3/7/2015,Quarter1,sweing,Saturday,11,0.8,11.41,471,3420,50,0,0,0,58,0.800035
3/7/2015,Quarter1,finishing,Saturday,6,0.5,2.9,?,960,0,0,0,0,8,0.7975
3/7/2015,Quarter1,sweing,Saturday,9,0.75,18.79,1226,3480,45,0,0,0,51,0.749987
3/7/2015,Quarter1,sweing,Saturday,10,0.7,21.82,1251,6000,30,0,0,0,50,0.700422
3/7/2015,Quarter1,finishing,Saturday,1,0.7,3.94,?,960,0,0,0,0,8,0.664875
3/7/2015,Quarter1,finishing,Saturday,4,0.7,3.94,?,960,0,0,0,0,8,0.664875
3/7/2015,Quarter1,finishing,Saturday,11,0.8,2.9,?,960,0,0,0,0,8,0.657083
3/7/2015,Quarter1,sweing,Saturday,2,0.65,16.1,626,4200,0,0,0,1,45,0.65024
3/7/2015,Quarter1,finishing,Saturday,8,0.8,4.6,?,3600,0,0,0,0,15,0.590741
3/7/2015,Quarter1,finishing,Saturday,2,0.65,3.9,?,1920,0,0,0,0,8,0.528125
3/7/2015,Quarter1,sweing,Saturday,6,0.5,23.41,1379,2280,0,0,0,1,39,0.500528
3/7/2015,Quarter1,sweing,Saturday,5,0.7,27.48,541,6960,24,0,0,1,58,0.40896
3/8/2015,Quarter2,finishing,Sunday,3,0.8,4.6,?,1440,0,0,0,0,12,0.951944
3/8/2015,Quarter2,finishing,Sunday,12,0.8,4.6,?,1080,0,0,0,0,9,0.945556
3/8/2015,Quarter2,finishing,Sunday,9,0.75,2.9,?,1080,0,0,0,0,9,0.929074
3/8/2015,Quarter2,finishing,Sunday,1,0.75,3.94,?,960,0,0,0,0,8,0.890604
3/8/2015,Quarter2,finishing,Sunday,4,0.75,3.94,?,960,0,0,0,0,8,0.890604
3/8/2015,Quarter2,finishing,Sunday,2,0.7,3.9,?,1200,0,0,0,0,10,0.884
3/8/2015,Quarter2,finishing,Sunday,5,0.5,3.94,?,960,0,0,0,0,8,0.857917
3/8/2015,Quarter2,sweing,Sunday,4,0.75,26.82,1082,6840,65,0,0,0,57,0.850084
3/8/2015,Quarter2,sweing,Sunday,1,0.75,26.82,1254,6960,65,0,0,0,58,0.850071
3/8/2015,Quarter2,sweing,Sunday,3,0.8,30.1,1278,3360,50,0,0,1,57,0.800511
3/8/2015,Quarter2,sweing,Sunday,12,0.8,15.26,1064,4080,63,0,0,0,34,0.800402
3/8/2015,Quarter2,sweing,Sunday,11,0.8,11.41,313,3420,50,0,0,0,58,0.800035
3/8/2015,Quarter2,finishing,Sunday,11,0.8,2.9,?,960,0,0,0,0,8,0.755208
3/8/2015,Quarter2,sweing,Sunday,9,0.75,18.79,1239,5640,45,0,0,0,52,0.750372
3/8/2015,Quarter2,sweing,Sunday,10,0.7,21.82,1335,6000,30,0,0,0,50,0.700422
3/8/2015,Quarter2,sweing,Sunday,2,0.7,16.1,928,4800,30,0,0,1,45,0.700106
3/8/2015,Quarter2,sweing,Sunday,6,0.6,23.41,1266,2520,23,0,0,1,38,0.601037
3/8/2015,Quarter2,sweing,Sunday,8,0.6,30.48,869,6720,0,0,0,1,56,0.600529
3/8/2015,Quarter2,sweing,Sunday,5,0.5,26.82,711,7080,23,0,0,1,59,0.500034
3/8/2015,Quarter2,finishing,Sunday,8,0.6,3.9,?,960,0,0,0,0,8,0.450937
3/8/2015,Quarter2,finishing,Sunday,10,0.7,2.9,?,960,0,0,0,0,8,0.441042
3/8/2015,Quarter2,finishing,Sunday,6,0.6,2.9,?,960,0,0,0,0,8,0.271875
3/9/2015,Quarter2,finishing,Monday,11,0.8,2.9,?,0,960,0,0,0,8,0.960625
3/9/2015,Quarter2,finishing,Monday,12,0.8,4.6,?,0,1080,0,0,0,9,0.902963
3/9/2015,Quarter2,finishing,Monday,5,0.6,3.94,?,0,2880,0,0,0,12,0.864343
3/9/2015,Quarter2,sweing,Monday,4,0.75,26.82,1079,7020,65,0,0,0,58,0.850446
3/9/2015,Quarter2,sweing,Monday,1,0.75,26.82,1322,7140,65,0,0,0,59,0.850427
3/9/2015,Quarter2,finishing,Monday,9,0.75,2.9,?,0,3600,0,0,0,15,0.841
3/9/2015,Quarter2,sweing,Monday,3,0.8,30.1,964,5160,50,0,0,1,58,0.800842
3/9/2015,Quarter2,sweing,Monday,12,0.8,15.26,1132,4080,63,0,0,0,34,0.800402
3/9/2015,Quarter2,sweing,Monday,11,0.8,11.41,357,3420,50,0,0,0,58,0.800035
3/9/2015,Quarter2,finishing,Monday,3,0.8,4.6,?,0,1440,0,0,0,12,0.795417
3/9/2015,Quarter2,finishing,Monday,4,0.75,3.94,?,0,960,0,0,0,8,0.795388
3/9/2015,Quarter2,finishing,Monday,1,0.75,3.94,?,0,960,0,0,0,8,0.794567
3/9/2015,Quarter2,sweing,Monday,9,0.75,18.79,1193,6240,45,0,0,0,52,0.750396
3/9/2015,Quarter2,sweing,Monday,2,0.7,16.1,817,5520,30,0,0,1,45,0.700516
3/9/2015,Quarter2,sweing,Monday,10,0.7,21.82,1576,6000,30,0,0,0,50,0.700422
3/9/2015,Quarter2,finishing,Monday,2,0.7,3.9,?,0,1200,0,0,0,10,0.6825
3/9/2015,Quarter2,sweing,Monday,6,0.65,23.41,1262,4560,35,0,0,1,38,0.650962
3/9/2015,Quarter2,sweing,Monday,8,0.65,30.48,953,6720,26,0,0,1,56,0.650421
3/9/2015,Quarter2,sweing,Monday,5,0.6,26.82,919,7080,23,0,0,1,59,0.600041
3/9/2015,Quarter2,sweing,Monday,7,0.5,30.48,1161,6600,0,0,0,1,55,0.500611
3/9/2015,Quarter2,finishing,Monday,10,0.7,2.9,?,0,960,0,0,0,8,0.477292
3/9/2015,Quarter2,finishing,Monday,8,0.65,3.9,?,0,960,0,0,0,8,0.264062
3/10/2015,Quarter2,finishing,Tuesday,12,0.8,4.6,?,1080,0,0,0,0,9,0.92
3/10/2015,Quarter2,finishing,Tuesday,5,0.6,3.94,?,1440,0,0,0,0,12,0.909392
3/10/2015,Quarter2,sweing,Tuesday,1,0.75,26.82,1574,7080,75,0,0,0,59,0.900061
3/10/2015,Quarter2,finishing,Tuesday,3,0.8,4.6,?,1440,0,0,0,0,12,0.894444
3/10/2015,Quarter2,finishing,Tuesday,4,0.75,3.94,?,960,0,0,0,0,8,0.881575
3/10/2015,Quarter2,finishing,Tuesday,1,0.75,3.94,?,960,0,0,0,0,8,0.880754
3/10/2015,Quarter2,sweing,Tuesday,4,0.75,26.82,1104,5880,65,0,0,0,59,0.850084
3/10/2015,Quarter2,finishing,Tuesday,9,0.75,2.9,?,1800,0,0,0,0,15,0.821667
3/10/2015,Quarter2,sweing,Tuesday,12,0.8,15.26,1069,4080,63,0,0,0,34,0.800402
3/10/2015,Quarter2,sweing,Tuesday,3,0.8,30.1,756,6960,63,0,0,1,58,0.800072
3/10/2015,Quarter2,sweing,Tuesday,11,0.8,11.41,338,3420,50,0,0,0,58,0.800035
3/10/2015,Quarter2,finishing,Tuesday,11,0.8,2.9,?,960,0,0,0,0,8,0.758229
3/10/2015,Quarter2,sweing,Tuesday,10,0.75,21.82,1499,6000,34,0,0,0,50,0.750608
3/10/2015,Quarter2,sweing,Tuesday,9,0.75,18.79,1247,6240,45,0,0,0,52,0.750396
3/10/2015,Quarter2,finishing,Tuesday,2,0.7,3.9,?,960,0,0,0,0,8,0.741
3/10/2015,Quarter2,sweing,Tuesday,8,0.7,30.48,923,6840,30,0,0,1,57,0.700505
3/10/2015,Quarter2,sweing,Tuesday,6,0.7,23.41,1180,4560,30,0,0,1,38,0.700246
3/10/2015,Quarter2,sweing,Tuesday,2,0.7,16.1,957,5400,40,0,0,1,45,0.700052
3/10/2015,Quarter2,sweing,Tuesday,5,0.65,26.82,1001,7080,26,0,0,1,59,0.650044
3/10/2015,Quarter2,sweing,Tuesday,7,0.6,30.48,1017,6840,25,0,0,1,57,0.630403
3/10/2015,Quarter2,finishing,Tuesday,8,0.65,3.9,?,960,0,0,0,0,8,0.560625
3/10/2015,Quarter2,finishing,Tuesday,7,0.5,3.9,?,960,0,0,0,0,8,0.560625
3/10/2015,Quarter2,finishing,Tuesday,10,0.7,2.9,?,960,0,0,0,0,8,0.39875
3/11/2015,Quarter2,finishing,Wednesday,12,0.8,4.6,?,2160,0,0,0,0,9,0.92284
3/11/2015,Quarter2,finishing,Wednesday,11,0.8,2.9,?,2400,0,0,0,0,10,0.874028
3/11/2015,Quarter2,finishing,Wednesday,2,0.75,3.9,?,1920,0,0,0,0,8,0.819271
3/11/2015,Quarter2,finishing,Wednesday,4,0.75,3.94,?,1920,0,0,0,0,8,0.813309
3/11/2015,Quarter2,finishing,Wednesday,1,0.75,3.94,?,1920,0,0,0,0,8,0.812625
3/11/2015,Quarter2,sweing,Wednesday,12,0.8,15.26,470,4080,63,0,0,0,34,0.800402
3/11/2015,Quarter2,sweing,Wednesday,3,0.8,30.1,735,6960,63,0,0,1,58,0.800072
3/11/2015,Quarter2,sweing,Wednesday,11,0.8,11.41,560,3420,50,0,0,0,58,0.800035
3/11/2015,Quarter2,finishing,Wednesday,3,0.8,4.6,?,1920,0,0,0,0,8,0.786632
3/11/2015,Quarter2,finishing,Wednesday,5,0.7,3.94,?,1440,0,0,0,0,12,0.75885
3/11/2015,Quarter2,sweing,Wednesday,10,0.75,21.82,1674,6000,34,0,0,0,50,0.750608
3/11/2015,Quarter2,sweing,Wednesday,9,0.75,18.79,290,5040,45,0,0,0,52,0.750347
3/11/2015,Quarter2,sweing,Wednesday,2,0.75,16.1,971,5400,45,0,0,1,45,0.750141
3/11/2015,Quarter2,sweing,Wednesday,1,0.75,26.82,1322,7080,45,0,0,0,59,0.750051
3/11/2015,Quarter2,sweing,Wednesday,4,0.75,26.82,1054,7080,45,0,0,0,59,0.750051
3/11/2015,Quarter2,sweing,Wednesday,5,0.7,26.82,992,6960,30,0,0,1,58,0.700557
3/11/2015,Quarter2,sweing,Wednesday,8,0.7,30.48,914,6840,30,0,0,1,57,0.700505
3/11/2015,Quarter2,sweing,Wednesday,6,0.7,23.41,1128,4560,40,0,0,1,38,0.700246
3/11/2015,Quarter2,sweing,Wednesday,7,0.65,30.48,935,6840,26,0,0,1,57,0.650596
3/11/2015,Quarter2,finishing,Wednesday,10,0.75,2.9,?,960,0,0,0,0,8,0.628333
3/11/2015,Quarter2,finishing,Wednesday,8,0.7,3.9,?,960,0,0,0,0,8,0.625625
3/11/2015,Quarter2,finishing,Wednesday,7,0.65,3.9,?,960,0,0,0,0,8,0.625625
3/11/2015,Quarter2,finishing,Wednesday,9,0.75,2.9,?,1800,0,0,0,0,15,0.505889
3/11/2015,Quarter2,finishing,Wednesday,6,0.7,2.9,?,720,0,0,0,0,6,0.394722
