"Rank","Country","Number"
1,'South Korea','50,600'
2,Thailand,'28,608'
3,Pakistan,'28,023'
4,India,'23,198'
5,'United States','20,996'
6,Russia,'19,239'
7,Indonesia,'15,050'
8,Laos,'14,645'
9,Japan,'14,230'
10,Kazakhastan,'11,784'
11,Vietnam,'11,299'
12,Bangladesh,'10,735'
13,France,'10,695'
14,Mongolia,'10,158'
15,Malaysia,'9,479'
