{
  "data_qualities": {
    "quality": [
      {
        "name": "AutoCorrelation",
        "value": []
      },
      {
        "name": "Dimensionality",
        "value": "0.00185"
      },
      {
        "name": "MajorityClassPercentage",
        "value": []
      },
      {
        "name": "MajorityClassSize",
        "value": []
      },
      {
        "name": "MinorityClassPercentage",
        "value": []
      },
      {
        "name": "MinorityClassSize",
        "value": []
      },
      {
        "name": "NumberOfBinaryFeatures",
        "value": "13.0"
      },
      {
        "name": "NumberOfClasses",
        "value": []
      },
      {
        "name": "NumberOfFeatures",
        "value": "37.0"
      },
      {
        "name": "NumberOfInstances",
        "value": "20000.0"
      },
      {
        "name": "NumberOfInstancesWithMissingValues",
        "value": "0.0"
      },
      {
        "name": "NumberOfMissingValues",
        "value": "0.0"
      },
      {
        "name": "NumberOfNumericFeatures",
        "value": "0.0"
      },
      {
        "name": "NumberOfSymbolicFeatures",
        "value": "37.0"
      },
      {
        "name": "PercentageOfBinaryFeatures",
        "value": "35.13513513513514"
      },
      {
        "name": "PercentageOfInstancesWithMissingValues",
        "value": "0.0"
      },
      {
        "name": "PercentageOfMissingValues",
        "value": "0.0"
      },
      {
        "name": "PercentageOfNumericFeatures",
        "value": "0.0"
      },
      {
        "name": "PercentageOfSymbolicFeatures",
        "value": "100.0"
      }
    ]
  }
}