{
  "data_set_description": {
    "contributor": [
      "All credit goes to Frances Ding",
      "Moritz Hardt",
      "John Miller",
      "Ludwig Schmidt"
    ],
    "creator": [
      "Frances Ding",
      "Moritz Hardt",
      "John Miller",
      "Ludwig Schmidt (authors are ordered alphabetically)"
    ],
    "default_target_attribute": "PINCP",
    "description": "The ACSIncome dataset is one of five datasets created by Ding et al. as an improved alternative to the popular UCI Adult dataset. The authors compiled data from the American Community Survey (ACS) Public Use Microdata Sample (PUMS). Data is provided for all 50 states and Puerto Rico. This upload represents the raw data from only 2018. The data contains 1,664,500 rows, 10 features, and 1 target variable. An additional column for the state code is provided for convenience.  All columns are described in the original publication (https://arxiv.org/pdf/2108.04884.pdf) as well as in the PUMS Data Dictionary (\nhttps://www2.census.gov/programs-surveys/acs/tech_docs/pums/data_dict/PUMS_Data_Dictionary_2018.pdf). Additional detail can also be found on the author's GitHub: https://github.com/zykls/folktables/",
    "description_version": "1",
    "file_id": "22101666",
    "format": "ARFF",
    "id": "43141",
    "licence": "CC0",
    "md5_checksum": "50c4f9df115d80a5bbc27ebff545ddc0",
    "minio_url": "https://data.openml.org/datasets/0004/43141/dataset_43141.pq",
    "name": "ACSIncome",
    "original_data_url": "https://github.com/zykls/folktables/",
    "paper_url": "https://arxiv.org/pdf/2108.04884.pdf",
    "parquet_url": "https://data.openml.org/datasets/0004/43141/dataset_43141.pq",
    "processing_date": "2022-01-12 15:28:19",
    "status": "active",
    "upload_date": "2022-01-12T15:27:53",
    "url": "https://api.openml.org/data/v1/download/22101666/ACSIncome.arff",
    "version": "3",
    "version_label": "v1.0.0",
    "visibility": "public"
  }
}