{
  "data_set_description": {
    "citation": "test citation",
    "collection_date": "15-12-2021",
    "creator": "test",
    "default_target_attribute": "Exercice",
    "description": "une description\n\ntest",
    "description_version": "2",
    "file_id": "22101612",
    "format": "arff",
    "id": "43127",
    "language": "English",
    "licence": "BSD (from scikit-learn)",
    "md5_checksum": "1da3741ae24f13e2ce52c742dd98e6ec",
    "minio_url": "https://data.openml.org/datasets/0004/43127/dataset_43127.pq",
    "name": "mytestdataset",
    "original_data_url": "https://www4.stat.ncsu.edu/~boos/var.select/diabetes.html",
    "paper_url": "test",
    "parquet_url": "https://data.openml.org/datasets/0004/43127/dataset_43127.pq",
    "processing_date": "2021-12-15 17:37:03",
    "status": "active",
    "upload_date": "2021-12-15T17:36:49",
    "url": "https://api.openml.org/data/v1/download/22101612/mytestdataset.arff",
    "version": "1",
    "version_label": "test",
    "visibility": "public"
  }
}