{
  "data_set_description": {
    "creator": "Lukas Brausch",
    "description": "This collection includes data sets of one-dimensional ultrasound raw RF data (A-Scans) acquired from the biceps brachii muscles of a single healthy volunteer. The annotation was performed by labeling the first 10 seconds of each data set as belonging to a relaxed muscle state and the last 10 seconds of each data set as belonging to a fatigue muscle states. Each line of the ARFF file contains an A-Scan consisting of 2048amplitude values, an annotation (whether this A-Scan belongs to a fatigue muscle state (1) or not (0)), a timestamp, the arm the signals were obtained from, the ID of the subject, the ID of the data set, the gender of the subject and the chosen lifted weight (2.5. kg, 5.0 kg or 7.5 kg).",
    "description_version": "1",
    "file_id": "22045957",
    "format": "ARFF",
    "id": "43076",
    "licence": "CC_BY-NC-SA",
    "md5_checksum": "3fb2fbf1c447c1356d0cd619d038a1d9",
    "minio_url": "https://data.openml.org/datasets/0004/43076/dataset_43076.pq",
    "name": "1DUltrasoundMuscleFatigueDataStudy2Of2",
    "parquet_url": "https://data.openml.org/datasets/0004/43076/dataset_43076.pq",
    "processing_date": "2021-08-09 14:00:03",
    "status": "active",
    "upload_date": "2021-08-09T13:59:05",
    "url": "https://api.openml.org/data/v1/download/22045957/1DUltrasoundMuscleFatigueDataStudy2Of2.arff",
    "version": "1",
    "version_label": "1.0",
    "visibility": "public"
  }
}