{
  "data_set_description": {
    "collection_date": "2018-10-12",
    "creator": "Department for Transport UK",
    "default_target_attribute": "Sex_of_Driver",
    "description": "Data reported to the police about the circumstances of personal injury road accidents in Great Britain from 1979, and the maker and model information of vehicles involved in the respective accident",
    "description_version": "1",
    "file_id": "22045889",
    "format": "arff",
    "id": "43069",
    "language": "English",
    "licence": "Open Government License",
    "md5_checksum": "1a38096b8f68d0dd808d7da069bb1aa1",
    "minio_url": "https://data.openml.org/datasets/0004/43069/dataset_43069.pq",
    "name": "road_safety",
    "original_data_url": "http://data.dft.gov.uk/road-accidents-safety-data/RoadSafetyData_2015.zip",
    "paper_url": "https://data.gov.uk/dataset/road-accidents-safety-data",
    "parquet_url": "https://data.openml.org/datasets/0004/43069/dataset_43069.pq",
    "processing_date": "2021-07-26 13:30:21",
    "row_id_attribute": "Accident_Index",
    "status": "active",
    "upload_date": "2021-07-26T13:29:25",
    "url": "https://api.openml.org/data/v1/download/22045889/road_safety.arff",
    "version": "4",
    "version_label": "0.1",
    "visibility": "public"
  }
}