{
  "data_set_description": {
    "citation": "Cerda, P., & Varoquaux, G. (2020). Encoding high-cardinality string categorical variables. IEEE Transactions on Knowledge and Data Engineering.",
    "collection_date": "2020",
    "creator": "P. Cerda and G. Varoquaux",
    "default_target_attribute": "PRODUCTTYPENAME",
    "description": "Product listing data submitted to the U.S. FDA for all unfinished, unapproved drugs.",
    "description_version": "1",
    "file_id": "22045785",
    "format": "arff",
    "id": "43044",
    "language": "English",
    "licence": "Public",
    "md5_checksum": "23e62eaccefb57f9d42c60c5b02be198",
    "minio_url": "https://data.openml.org/datasets/0004/43044/dataset_43044.pq",
    "name": "drug-directory",
    "original_data_url": "https://www.fda.gov/drugs/drug-approvals-and-databases/national-drug-code-directory",
    "parquet_url": "https://data.openml.org/datasets/0004/43044/dataset_43044.pq",
    "processing_date": "2021-06-18 20:40:08",
    "row_id_attribute": "ROW_ID",
    "status": "active",
    "upload_date": "2021-06-18T20:39:59",
    "url": "https://api.openml.org/data/v1/download/22045785/drug-directory.arff",
    "version": "2",
    "visibility": "public"
  }
}