{
  "data_qualities": {
    "quality": [
      {
        "name": "AutoCorrelation",
        "value": "1.0"
      },
      {
        "name": "Dimensionality",
        "value": "28.5"
      },
      {
        "name": "MajorityClassPercentage",
        "value": "100.0"
      },
      {
        "name": "MajorityClassSize",
        "value": "2.0"
      },
      {
        "name": "MinorityClassPercentage",
        "value": "100.0"
      },
      {
        "name": "MinorityClassSize",
        "value": "2.0"
      },
      {
        "name": "NumberOfBinaryFeatures",
        "value": "3.0"
      },
      {
        "name": "NumberOfClasses",
        "value": "1.0"
      },
      {
        "name": "NumberOfFeatures",
        "value": "57.0"
      },
      {
        "name": "NumberOfInstances",
        "value": "2.0"
      },
      {
        "name": "NumberOfInstancesWithMissingValues",
        "value": "2.0"
      },
      {
        "name": "NumberOfMissingValues",
        "value": "22.0"
      },
      {
        "name": "NumberOfNumericFeatures",
        "value": "21.0"
      },
      {
        "name": "NumberOfSymbolicFeatures",
        "value": "36.0"
      },
      {
        "name": "PercentageOfBinaryFeatures",
        "value": "5.263157894736842"
      },
      {
        "name": "PercentageOfInstancesWithMissingValues",
        "value": "100.0"
      },
      {
        "name": "PercentageOfMissingValues",
        "value": "19.298245614035086"
      },
      {
        "name": "PercentageOfNumericFeatures",
        "value": "36.84210526315789"
      },
      {
        "name": "PercentageOfSymbolicFeatures",
        "value": "63.1578947368421"
      }
    ]
  }
}