{
  "data_qualities": {
    "quality": [
      {
        "name": "AutoCorrelation",
        "value": "1.0"
      },
      {
        "name": "Dimensionality",
        "value": "57.0"
      },
      {
        "name": "MajorityClassPercentage",
        "value": "100.0"
      },
      {
        "name": "MajorityClassSize",
        "value": "1.0"
      },
      {
        "name": "MinorityClassPercentage",
        "value": "100.0"
      },
      {
        "name": "MinorityClassSize",
        "value": "1.0"
      },
      {
        "name": "NumberOfBinaryFeatures",
        "value": "0.0"
      },
      {
        "name": "NumberOfClasses",
        "value": "1.0"
      },
      {
        "name": "NumberOfFeatures",
        "value": "57.0"
      },
      {
        "name": "NumberOfInstances",
        "value": "1.0"
      },
      {
        "name": "NumberOfInstancesWithMissingValues",
        "value": "1.0"
      },
      {
        "name": "NumberOfMissingValues",
        "value": "11.0"
      },
      {
        "name": "NumberOfNumericFeatures",
        "value": "22.0"
      },
      {
        "name": "NumberOfSymbolicFeatures",
        "value": "35.0"
      },
      {
        "name": "PercentageOfBinaryFeatures",
        "value": "0.0"
      },
      {
        "name": "PercentageOfInstancesWithMissingValues",
        "value": "100.0"
      },
      {
        "name": "PercentageOfMissingValues",
        "value": "19.298245614035086"
      },
      {
        "name": "PercentageOfNumericFeatures",
        "value": "38.59649122807017"
      },
      {
        "name": "PercentageOfSymbolicFeatures",
        "value": "61.40350877192983"
      }
    ]
  }
}