{
  "data_features": {
    "feature": [
      {
        "data_type": "numeric",
        "index": "0",
        "is_ignore": "false",
        "is_row_identifier": "false",
        "is_target": "false",
        "name": "Age",
        "number_of_missing_values": "0"
      },
      {
        "data_type": "string",
        "index": "1",
        "is_ignore": "false",
        "is_row_identifier": "false",
        "is_target": "false",
        "name": "Gender",
        "number_of_missing_values": "0"
      },
      {
        "data_type": "string",
        "index": "2",
        "is_ignore": "false",
        "is_row_identifier": "false",
        "is_target": "false",
        "name": "Polyuria",
        "number_of_missing_values": "0"
      },
      {
        "data_type": "string",
        "index": "3",
        "is_ignore": "false",
        "is_row_identifier": "false",
        "is_target": "false",
        "name": "Polydipsia",
        "number_of_missing_values": "0"
      },
      {
        "data_type": "string",
        "index": "4",
        "is_ignore": "false",
        "is_row_identifier": "false",
        "is_target": "false",
        "name": "sudden weight loss",
        "number_of_missing_values": "0"
      },
      {
        "data_type": "string",
        "index": "5",
        "is_ignore": "false",
        "is_row_identifier": "false",
        "is_target": "false",
        "name": "weakness",
        "number_of_missing_values": "0"
      },
      {
        "data_type": "string",
        "index": "6",
        "is_ignore": "false",
        "is_row_identifier": "false",
        "is_target": "false",
        "name": "Polyphagia",
        "number_of_missing_values": "0"
      },
      {
        "data_type": "string",
        "index": "7",
        "is_ignore": "false",
        "is_row_identifier": "false",
        "is_target": "false",
        "name": "Genital thrush",
        "number_of_missing_values": "0"
      },
      {
        "data_type": "string",
        "index": "8",
        "is_ignore": "false",
        "is_row_identifier": "false",
        "is_target": "false",
        "name": "visual blurring",
        "number_of_missing_values": "0"
      },
      {
        "data_type": "string",
        "index": "9",
        "is_ignore": "false",
        "is_row_identifier": "false",
        "is_target": "false",
        "name": "Itching",
        "number_of_missing_values": "0"
      },
      {
        "data_type": "string",
        "index": "10",
        "is_ignore": "false",
        "is_row_identifier": "false",
        "is_target": "false",
        "name": "Irritability",
        "number_of_missing_values": "0"
      },
      {
        "data_type": "string",
        "index": "11",
        "is_ignore": "false",
        "is_row_identifier": "false",
        "is_target": "false",
        "name": "delayed healing",
        "number_of_missing_values": "0"
      },
      {
        "data_type": "string",
        "index": "12",
        "is_ignore": "false",
        "is_row_identifier": "false",
        "is_target": "false",
        "name": "partial paresis",
        "number_of_missing_values": "0"
      },
      {
        "data_type": "string",
        "index": "13",
        "is_ignore": "false",
        "is_row_identifier": "false",
        "is_target": "false",
        "name": "muscle stiffness",
        "number_of_missing_values": "0"
      },
      {
        "data_type": "string",
        "index": "14",
        "is_ignore": "false",
        "is_row_identifier": "false",
        "is_target": "false",
        "name": "Alopecia",
        "number_of_missing_values": "0"
      },
      {
        "data_type": "string",
        "index": "15",
        "is_ignore": "false",
        "is_row_identifier": "false",
        "is_target": "false",
        "name": "Obesity",
        "number_of_missing_values": "0"
      },
      {
        "data_type": "string",
        "index": "16",
        "is_ignore": "false",
        "is_row_identifier": "false",
        "is_target": "false",
        "name": "class",
        "number_of_missing_values": "0"
      }
    ]
  }
}