{
  "data_set_description": {
    "citation": "test",
    "collection_date": "06-05-2018",
    "creator": "Dr Christos Anagnostopoulos",
    "description": "test",
    "description_version": "1",
    "file_id": "22045650",
    "format": "arff",
    "id": "42981",
    "language": "English",
    "licence": "Publicly available",
    "md5_checksum": "a75cd10c9ba3b887623f37076a0ebc87",
    "minio_url": "https://data.openml.org/datasets/0004/42981/dataset_42981.pq",
    "name": "gnfuv-pi-4",
    "original_data_url": "https://archive.ics.uci.edu/ml/datasets/GNFUV+Unmanned+Surface+Vehicles+Sensor+Data",
    "parquet_url": "https://data.openml.org/datasets/0004/42981/dataset_42981.pq",
    "processing_date": "2021-05-28 11:18:07",
    "status": "active",
    "upload_date": "2021-05-28T11:17:51",
    "url": "https://api.openml.org/data/v1/download/22045650/gnfuv-pi-4.arff",
    "version": "1",
    "version_label": "1",
    "visibility": "public"
  }
}