"Player1","Player2","Round","Result","FNL1","FNL2","FSP.1","FSW.1","SSP.1","SSW.1","ACE.1","DBF.1","WNR.1","UFE.1","BPC.1","BPW.1","NPA.1","NPW.1","TPW.1","ST1.1","ST2.1","ST3.1","ST4.1","ST5.1","FSP.2","FSW.2","SSP.2","SSW.2","ACE.2","DBF.2","WNR.2","UFE.2","BPC.2","BPW.2","NPA.2","NPW.2","TPW.2","ST1.2","ST2.2","ST3.2","ST4.2","ST5.2"
'Serena Williams','Ashleigh Barty',1,1,2.0,0.0,59,20,41,8,6.0,2.0,31,17,5.0,10.0,10.0,11.0,58,6.0,6.0,?,?,?,51,14,49,11,1.0,4.0,5,18,0.0,0.0,2.0,4.0,31,2.0,1.0,?,?,?
'Vesna Dolonc','Lara Arruabarrena',1,1,2.0,1.0,65,33,35,10,7.0,4.0,7,4,5.0,10.0,?,?,78,2.0,6.0,6.0,?,?,62,33,38,10,0.0,3.0,0,3,4.0,7.0,?,?,74,6.0,2.0,4.0,?,?
'Pauline Parmentier','Karolina Pliskova',1,0,0.0,2.0,63,16,37,4,3.0,6.0,3,6,0.0,2.0,?,?,37,0.0,1.0,?,?,?,60,26,40,7,5.0,0.0,5,0,5.0,14.0,?,?,64,6.0,6.0,?,?,?
'Heather Watson','Daniela Hantuchova',1,0,1.0,2.0,61,41,39,19,8.0,3.0,27,45,4.0,7.0,10.0,13.0,88,5.0,6.0,3.0,?,?,68,43,32,10,6.0,2.0,37,44,5.0,13.0,5.0,8.0,102,7.0,3.0,6.0,?,?
'Samantha Stosur','Klara Zakopalova',1,1,2.0,0.0,65,28,35,11,6.0,1.0,19,18,7.0,10.0,7.0,10.0,74,6.0,6.0,?,?,?,50,18,50,7,1.0,5.0,27,27,4.0,14.0,10.0,15.0,60,3.0,4.0,?,?,?
'Tsvetana Pironkova','Silvia Soler-Espinosa',1,1,2.0,0.0,62,28,38,12,5.0,0.0,30,21,3.0,5.0,4.0,7.0,68,6.0,6.0,?,?,?,50,18,50,14,3.0,2.0,11,23,0.0,3.0,6.0,6.0,44,3.0,2.0,?,?,?
'Annika Beck','Petra Martic',1,1,2.0,0.0,67,18,33,8,0.0,0.0,8,10,6.0,11.0,3.0,3.0,52,6.0,6.0,?,?,?,50,8,50,4,2.0,6.0,7,34,0.0,2.0,3.0,7.0,25,0.0,0.0,?,?,?
'Kiki Bertens','Ana Ivanovic',1,0,0.0,2.0,61,15,39,11,2.0,4.0,23,35,6.0,11.0,10.0,16.0,61,4.0,4.0,?,?,?,60,24,40,9,3.0,4.0,14,22,8.0,9.0,4.0,6.0,73,6.0,6.0,?,?,?
'Roberta Vinci','Jie Zheng',1,0,0.0,2.0,66,23,34,7,3.0,3.0,20,28,3.0,10.0,7.0,12.0,56,4.0,3.0,?,?,?,68,26,32,10,0.0,2.0,26,25,5.0,7.0,1.0,2.0,67,6.0,6.0,?,?,?
'Patricia Mayr-Achleitner','Madison Keys',1,0,1.0,2.0,71,48,29,14,0.0,1.0,0,1,5.0,12.0,?,?,113,2.0,7.0,7.0,?,?,52,45,48,30,11.0,4.0,11,4,8.0,10.0,?,?,135,6.0,6.0,9.0,?,?
'Casey Dellacqua','Vera Zvonareva',1,1,2.0,0.0,66,22,34,13,0.0,0.0,10,19,4.0,10.0,1.0,2.0,67,6.0,6.0,?,?,?,65,22,35,9,2.0,4.0,14,43,0.0,1.0,5.0,8.0,40,2.0,2.0,?,?,?
'Laura Robson','Kirsten Flipkens',1,0,0.0,2.0,57,14,43,5,2.0,5.0,12,32,0.0,0.0,6.0,10.0,27,3.0,0.0,?,?,?,57,18,43,11,7.0,2.0,14,4,5.0,6.0,2.0,4.0,54,6.0,6.0,?,?,?
'Eugenie Bouchard','Hao Chen Tang',1,1,2.0,0.0,64,30,36,16,1.0,4.0,1,4,5.0,11.0,?,?,82,7.0,6.0,?,?,?,57,21,43,12,1.0,6.0,1,6,2.0,7.0,?,?,64,5.0,1.0,?,?,?
'Alison Van Uytvanck','Virginie Razzano',1,0,0.0,2.0,54,32,46,15,5.0,4.0,22,40,2.0,7.0,4.0,6.0,78,6.0,6.0,?,?,?,58,39,42,18,7.0,9.0,21,41,2.0,3.0,8.0,11.0,82,7.0,7.0,?,?,?
'Sachia Vickery','Lauren Davis',1,0,0.0,2.0,51,14,49,12,?,3.0,8,36,3.0,5.0,5.0,11.0,47,3.0,3.0,?,?,?,61,23,39,7,?,0.0,15,23,6.0,7.0,7.0,12.0,63,6.0,6.0,?,?,?
'Julia Goerges','Sara Errani',1,1,2.0,0.0,50,20,50,15,4.0,2.0,39,36,5.0,9.0,7.0,10.0,65,6.0,6.0,?,?,?,77,21,23,5,1.0,0.0,6,11,2.0,5.0,4.0,4.0,49,3.0,2.0,?,?,?
'Na Li','Ana Konjuh',1,1,2.0,0.0,76,24,24,7,3.0,0.0,20,18,5.0,12.0,13.0,19.0,61,6.0,6.0,?,?,?,50,13,50,9,0.0,5.0,7,25,0.0,1.0,3.0,6.0,36,2.0,0.0,?,?,?
'Belinda Bencic','Kimiko Date-Krumm',1,1,2.0,1.0,53,25,47,15,5.0,5.0,27,44,10.0,20.0,7.0,14.0,94,6.0,4.0,6.0,?,?,71,31,29,10,1.0,4.0,29,47,8.0,13.0,9.0,17.0,87,4.0,6.0,3.0,?,?
'Donna Vekic','Lucie Hradecka',1,0,0.0,2.0,47,17,53,9,1.0,2.0,1,2,0.0,5.0,?,?,37,3.0,1.0,?,?,?,54,23,46,12,9.0,4.0,9,4,4.0,7.0,?,?,58,6.0,6.0,?,?,?
'Julia Glushko','Lucie Safarova',1,0,1.0,2.0,61,35,39,20,6.0,3.0,6,3,2.0,7.0,?,?,82,5.0,6.0,1.0,?,?,59,37,41,21,3.0,4.0,3,4,4.0,8.0,?,?,92,7.0,3.0,6.0,?,?
'Ekaterina Makarova','Venus Williams',1,1,2.0,1.0,63,43,37,17,1.0,4.0,21,26,5.0,12.0,6.0,10.0,97,2.0,6.0,6.0,?,?,55,36,45,18,5.0,8.0,50,56,5.0,14.0,20.0,24.0,103,6.0,4.0,4.0,?,?
'Anabel Medina Garrigues','Irina Falconi',1,0,0.0,2.0,86,18,14,3,0.0,1.0,0,1,2.0,4.0,?,?,41,3.0,1.0,?,?,?,53,18,47,13,3.0,3.0,3,3,6.0,7.0,?,?,60,6.0,6.0,?,?,?
'Shahar Peer','Monica Niculescu',1,0,0.0,2.0,80,21,20,2,2.0,1.0,23,38,3.0,7.0,9.0,23.0,49,4.0,1.0,?,?,?,82,26,18,3,1.0,0.0,10,13,7.0,10.0,10.0,14.0,61,6.0,6.0,?,?,?
'Mirjana Lucic-Baroni','Sabine Lisicki',1,0,0.0,2.0,43,17,57,8,2.0,10.0,11,26,0.0,7.0,0.0,3.0,51,2.0,1.0,?,?,?,52,32,48,15,7.0,6.0,28,24,4.0,8.0,10.0,14.0,75,6.0,6.0,?,?,?
'Angelique Kerber','Jarmila Gajdosova',1,1,2.0,1.0,65,36,35,13,6.0,5.0,30,17,4.0,7.0,9.0,12.0,81,6.0,0.0,6.0,?,?,53,29,47,12,2.0,6.0,41,31,4.0,11.0,22.0,33.0,80,3.0,6.0,2.0,?,?
'Caroline Garcia','Alla Kudryavtseva',1,0,0.0,2.0,58,22,42,15,3.0,7.0,3,7,4.0,6.0,?,?,77,2.0,6.0,?,?,?,58,37,42,14,3.0,4.0,3,4,6.0,10.0,?,?,93,6.0,7.0,?,?,?
'Dinah Pfizenmaier','Yanina Wickmayer',1,0,0.0,2.0,48,24,52,23,3.0,12.0,3,12,2.0,15.0,?,?,87,6.0,3.0,?,?,?,58,38,42,15,6.0,8.0,6,8,4.0,7.0,?,?,95,7.0,6.0,?,?,?
'Alison Riske','Elena Vesnina',1,1,2.0,0.0,64,24,36,8,4.0,3.0,15,16,4.0,8.0,5.0,5.0,57,6.0,6.0,?,?,?,62,17,38,10,2.0,4.0,9,31,0.0,0.0,1.0,1.0,34,2.0,2.0,?,?,?
'Flavia Pennetta','Alexandra Cadantu',1,1,2.0,0.0,40,16,60,14,2.0,3.0,28,21,6.0,17.0,9.0,11.0,66,6.0,6.0,?,?,?,58,14,42,9,1.0,8.0,13,36,1.0,3.0,5.0,8.0,41,0.0,2.0,?,?,?
'Monica Puig','Anna Tatishvili',1,1,2.0,0.0,61,30,39,13,8.0,5.0,25,27,4.0,5.0,6.0,6.0,68,6.0,6.0,?,?,?,68,20,32,5,0.0,4.0,10,23,1.0,8.0,6.0,7.0,48,2.0,4.0,?,?,?
'Shuai Zhang','Mona Barthel',1,0,0.0,2.0,75,31,25,8,2.0,1.0,17,21,2.0,6.0,8.0,10.0,68,6.0,3.0,?,?,?,69,41,31,10,2.0,3.0,33,30,3.0,6.0,8.0,9.0,77,7.0,6.0,?,?,?
'Luksika Kumkhum','Petra Kvitova',1,1,2.0,1.0,48,26,52,20,4.0,6.0,28,27,5.0,16.0,7.0,8.0,92,6.0,1.0,6.0,?,?,60,36,40,15,3.0,8.0,32,40,4.0,12.0,12.0,16.0,80,2.0,6.0,4.0,?,?
'Jelena Jankovic','Misaki Doi',1,1,2.0,0.0,60,23,40,11,6.0,6.0,20,19,5.0,8.0,2.0,4.0,59,6.0,6.0,?,?,?,52,12,48,5,1.0,3.0,10,26,1.0,8.0,0.0,2.0,36,1.0,2.0,?,?,?
'Nadiya Kichenok','Ayumi Morita',1,0,0.0,2.0,63,27,37,11,4.0,7.0,24,43,2.0,8.0,11.0,14.0,68,2.0,6.0,?,?,?,62,30,38,16,6.0,2.0,20,24,4.0,5.0,1.0,3.0,75,6.0,7.0,?,?,?
'Kurumi Nara','Shuai Peng',1,1,2.0,1.0,74,39,26,10,1.0,6.0,23,37,8.0,16.0,2.0,4.0,103,7.0,4.0,6.0,?,?,63,40,37,16,3.0,5.0,36,54,6.0,10.0,4.0,6.0,96,5.0,6.0,3.0,?,?
'Andrea Petkovic','Magdalena Rybarikova',1,0,0.0,2.0,68,23,32,6,1.0,4.0,15,31,1.0,3.0,7.0,11.0,48,2.0,3.0,?,?,?,67,27,33,8,4.0,1.0,18,16,5.0,8.0,9.0,16.0,66,6.0,6.0,?,?,?
'Sorana Cirstea','Marina Erakovic',1,0,0.0,2.0,57,25,43,13,5.0,1.0,20,32,3.0,14.0,6.0,7.0,78,4.0,6.0,?,?,?,59,35,41,17,6.0,5.0,28,45,4.0,6.0,5.0,8.0,83,6.0,7.0,?,?,?
'Zarina Diyas','Katerina Siniakova',1,1,2.0,0.0,74,33,26,6,1.0,4.0,1,4,5.0,6.0,?,?,72,6.0,6.0,?,?,?,57,22,43,10,2.0,3.0,2,3,2.0,6.0,?,?,58,2.0,4.0,?,?,?
'Lesia Tsurenko','Varvara Lepchenko',1,0,1.0,2.0,63,35,37,20,1.0,3.0,9,34,3.0,9.0,0.0,1.0,92,6.0,3.0,4.0,?,?,64,42,36,15,3.0,5.0,32,52,3.0,9.0,11.0,13.0,93,2.0,6.0,6.0,?,?
'Katarzyna Piter','Simona Halep',1,0,0.0,2.0,77,12,23,1,1.0,3.0,5,25,0.0,2.0,5.0,8.0,24,0.0,1.0,?,?,?,61,21,39,9,3.0,2.0,13,14,5.0,9.0,1.0,2.0,52,6.0,6.0,?,?,?
'Carla Suarez Navarro','Vania King',1,1,2.0,0.0,79,31,21,4,0.0,1.0,17,19,4.0,5.0,6.0,9.0,61,6.0,6.0,?,?,?,69,20,31,5,1.0,2.0,12,28,1.0,2.0,5.0,14.0,42,3.0,2.0,?,?,?
'Galina Voskoboeva','Irina-Camelia Begu',1,1,2.0,1.0,64,41,36,18,3.0,3.0,3,3,6.0,11.0,?,?,109,7.0,4.0,7.0,?,?,62,44,38,15,2.0,7.0,2,7,5.0,9.0,?,?,94,5.0,6.0,5.0,?,?
'Kristina Mladenovic','Stefanie Voegele',1,0,0.0,2.0,48,29,52,19,3.0,8.0,23,41,1.0,1.0,14.0,22.0,61,5.0,5.0,?,?,?,66,32,34,13,7.0,1.0,19,20,3.0,12.0,5.0,7.0,76,7.0,7.0,?,?,?
'Francesca Schiavone','Dominika Cibulkova',1,0,0.0,2.0,60,21,40,11,5.0,2.0,14,27,1.0,6.0,5.0,11.0,57,3.0,4.0,?,?,?,61,33,39,14,0.0,6.0,21,30,3.0,7.0,6.0,7.0,72,6.0,6.0,?,?,?
'Alize Cornet','Polona Hercog',1,0,?,?,75,3,25,1,1.0,?,2,0,?,?,1.0,1.0,5,?,?,?,?,?,0,0,100,1,0.0,?,1,1,?,?,0.0,0.0,1,?,?,?,?,?
'Camila Giorgi','Storm Sanders',1,1,2.0,1.0,51,38,49,23,5.0,13.0,27,47,4.0,12.0,3.0,7.0,97,4.0,6.0,6.0,?,?,63,35,37,12,2.0,3.0,13,34,2.0,7.0,4.0,4.0,81,6.0,1.0,4.0,?,?
'Paula Ormaechea','Karin Knapp',1,0,0.0,2.0,57,26,43,7,2.0,7.0,2,7,2.0,3.0,?,?,56,4.0,2.0,?,?,?,61,26,39,8,4.0,3.0,4,3,5.0,10.0,?,?,69,6.0,6.0,?,?,?
'Bethanie Mattek-Sands','Maria Sharapova',1,0,0.0,2.0,57,27,43,10,4.0,8.0,18,30,2.0,6.0,7.0,9.0,65,3.0,4.0,?,?,?,53,31,47,13,5.0,9.0,29,28,4.0,8.0,3.0,7.0,77,6.0,6.0,?,?,?
'Agnieszka Radwanska','Yulia Putintseva',1,1,2.0,1.0,59,36,41,15,9.0,1.0,38,31,7.0,11.0,22.0,35.0,96,6.0,5.0,6.0,?,?,52,29,48,16,0.0,6.0,27,33,3.0,8.0,11.0,17.0,76,0.0,7.0,2.0,?,?
'Olga Govortsova','Ying-Ying Duan',1,1,2.0,0.0,68,35,32,8,10.0,4.0,10,4,4.0,12.0,?,?,78,6.0,7.0,?,?,?,60,24,40,16,1.0,1.0,1,1,1.0,5.0,?,?,62,0.0,6.0,?,?,?
'Carina Witthoeft','Mandy Minella',1,0,0.0,2.0,62,16,38,10,1.0,4.0,1,4,2.0,6.0,?,?,47,1.0,4.0,?,?,?,56,17,44,16,0.0,2.0,0,2,5.0,8.0,?,?,62,6.0,6.0,?,?,?
'Teliana Pereira','Anastasia Pavlyuchenkova',1,0,0.0,2.0,68,43,32,14,3.0,7.0,3,7,2.0,4.0,?,?,84,6.0,4.0,?,?,?,62,32,38,15,3.0,5.0,3,5,3.0,12.0,?,?,93,7.0,6.0,?,?,?
'Kaia Kanepi','Garbine Muguruza',1,0,1.0,2.0,64,27,36,12,6.0,3.0,22,39,3.0,9.0,3.0,4.0,69,2.0,6.0,2.0,?,?,51,28,49,20,5.0,4.0,26,31,5.0,12.0,1.0,3.0,85,6.0,2.0,6.0,?,?
'Timea Babos','Anna Schmiedlova',1,0,1.0,2.0,60,46,40,17,8.0,11.0,8,11,5.0,24.0,?,?,120,6.0,4.0,5.0,?,?,66,54,34,23,5.0,5.0,5,5,6.0,14.0,?,?,126,4.0,6.0,7.0,?,?
'Christina McHale','Yung-Jan Chan',1,1,2.0,0.0,71,31,29,11,4.0,3.0,4,3,5.0,9.0,?,?,77,7.0,6.0,?,?,?,68,28,32,10,0.0,6.0,0,6,3.0,3.0,?,?,66,5.0,4.0,?,?,?
'Lourdes Dominguez Lino','Caroline Wozniacki',1,0,0.0,2.0,58,10,42,8,?,2.0,9,30,1.0,2.0,5.0,7.0,31,0.0,2.0,?,?,?,61,17,39,11,?,2.0,15,16,6.0,12.0,11.0,18.0,58,6.0,6.0,?,?,?
'Sloane Stephens','Yaroslava Shvedova',1,1,2.0,0.0,75,31,25,7,1.0,1.0,22,27,6.0,12.0,1.0,3.0,82,7.0,6.0,?,?,?,58,22,42,10,3.0,13.0,14,43,4.0,6.0,3.0,6.0,61,6.0,3.0,?,?,?
'Tadeja Majeric','Ajla Tomljanovic',1,0,1.0,2.0,72,54,28,10,4.0,7.0,4,7,3.0,6.0,?,?,99,6.0,6.0,4.0,?,?,49,36,51,25,5.0,6.0,5,6,3.0,6.0,?,?,97,3.0,7.0,6.0,?,?
'Olivia Rogowska','Mariana Duque-Marino',1,1,2.0,0.0,63,25,37,10,2.0,6.0,21,31,6.0,13.0,4.0,5.0,66,6.0,6.0,?,?,?,67,18,33,5,4.0,4.0,10,32,3.0,8.0,2.0,6.0,47,3.0,3.0,?,?,?
'Elina Svitolina','Svetlana Kuznetsova',1,1,2.0,0.0,61,26,39,8,5.0,5.0,27,21,5.0,12.0,12.0,18.0,65,6.0,6.0,?,?,?,48,20,52,11,1.0,4.0,17,24,2.0,4.0,4.0,5.0,53,3.0,3.0,?,?,?
'Bojana Jovanovski','Jana Cepelova',1,1,2.0,1.0,76,43,24,11,0.0,1.0,0,1,9.0,13.0,?,?,100,6.0,6.0,6.0,?,?,69,28,31,7,2.0,5.0,2,5,5.0,12.0,?,?,81,7.0,1.0,3.0,?,?
'Chanelle Scheepers','Yvonne Meusburger',1,0,0.0,2.0,53,27,47,12,2.0,13.0,2,13,4.0,7.0,?,?,71,6.0,4.0,?,?,?,68,32,32,12,1.0,5.0,1,5,5.0,11.0,?,?,80,7.0,6.0,?,?,?
'Su-Wei Hsieh','Barbora Zahlavova Strycova',1,0,1.0,2.0,58,33,42,15,1.0,5.0,14,39,1.0,4.0,11.0,16.0,75,1.0,6.0,1.0,?,?,68,39,32,13,5.0,2.0,31,36,5.0,17.0,22.0,28.0,95,6.0,4.0,6.0,?,?
'Johanna Larsson','Victoria Azarenka',1,0,0.0,2.0,72,24,28,5,2.0,5.0,13,29,3.0,10.0,4.0,5.0,59,6.0,2.0,?,?,?,75,41,25,4,0.0,7.0,27,32,5.0,5.0,15.0,17.0,80,7.0,6.0,?,?,?
'Serena Williams','Vesna Dolonc',2,1,2.0,0.0,66,28,34,8,10.0,2.0,24,19,4.0,7.0,3.0,4.0,61,6.0,6.0,?,?,?,54,17,46,6,2.0,8.0,9,20,0.0,1.0,3.0,3.0,37,1.0,2.0,?,?,?
'Karolina Pliskova','Daniela Hantuchova',2,0,1.0,2.0,55,50,45,28,11.0,6.0,57,60,3.0,14.0,15.0,17.0,123,3.0,6.0,1.0,?,?,59,53,41,28,9.0,8.0,43,35,4.0,9.0,10.0,14.0,129,6.0,3.0,1.0,?,?
'Samantha Stosur','Tsvetana Pironkova',2,1,2.0,0.0,59,20,41,10,4.0,3.0,23,15,5.0,13.0,13.0,17.0,58,6.0,6.0,?,?,?,57,15,43,4,1.0,2.0,5,19,0.0,1.0,5.0,6.0,30,2.0,0.0,?,?,?
'Annika Beck','Ana Ivanovic',2,0,0.0,2.0,75,13,25,3,0.0,3.0,10,29,2.0,3.0,5.0,8.0,35,1.0,2.0,?,?,?,54,16,46,13,2.0,2.0,16,17,6.0,7.0,0.0,1.0,57,6.0,6.0,?,?,?
'Jie Zheng','Madison Keys',2,1,2.0,1.0,76,40,24,14,0.0,4.0,19,48,7.0,10.0,10.0,15.0,102,7.0,1.0,7.0,?,?,63,39,37,18,3.0,1.0,30,43,8.0,16.0,6.0,11.0,109,6.0,6.0,5.0,?,?
'Casey Dellacqua','Kirsten Flipkens',2,1,2.0,0.0,73,22,27,6,1.0,0.0,15,15,6.0,19.0,7.0,10.0,61,6.0,6.0,?,?,?,48,15,52,10,0.0,7.0,17,29,1.0,1.0,10.0,13.0,38,3.0,0.0,?,?,?
'Eugenie Bouchard','Virginie Razzano',2,1,2.0,0.0,50,26,50,17,4.0,2.0,25,25,5.0,10.0,3.0,7.0,84,6.0,7.0,?,?,?,75,32,25,6,2.0,1.0,27,42,3.0,9.0,13.0,17.0,71,2.0,6.0,?,?,?
'Lauren Davis','Julia Goerges',2,1,2.0,1.0,69,51,31,15,0.0,6.0,14,20,3.0,7.0,5.0,7.0,94,7.0,2.0,6.0,?,?,71,45,29,11,6.0,1.0,42,47,3.0,13.0,12.0,15.0,98,5.0,6.0,4.0,?,?
'Na Li','Belinda Bencic',2,1,2.0,0.0,60,27,40,12,4.0,2.0,30,31,5.0,7.0,2.0,5.0,67,6.0,7.0,?,?,?,54,21,46,8,2.0,5.0,12,19,2.0,2.0,3.0,4.0,53,0.0,6.0,?,?,?
'Lucie Hradecka','Lucie Safarova',2,0,1.0,2.0,44,33,56,26,9.0,9.0,9,9,0.0,6.0,?,?,90,7.0,3.0,0.0,?,?,62,47,38,20,6.0,7.0,6,7,4.0,13.0,?,?,113,6.0,6.0,6.0,?,?
'Ekaterina Makarova','Irina Falconi',2,1,2.0,0.0,56,26,44,14,4.0,6.0,18,28,5.0,13.0,9.0,14.0,74,6.0,7.0,?,?,?,74,22,26,10,0.0,2.0,18,40,2.0,4.0,3.0,7.0,55,2.0,5.0,?,?,?
'Monica Niculescu','Sabine Lisicki',2,1,2.0,1.0,66,35,34,9,0.0,6.0,8,18,7.0,14.0,12.0,16.0,87,2.0,6.0,6.0,?,?,53,23,47,14,10.0,6.0,43,56,5.0,6.0,19.0,34.0,76,6.0,2.0,2.0,?,?
'Angelique Kerber','Alla Kudryavtseva',2,1,2.0,0.0,59,24,41,11,3.0,1.0,22,10,4.0,13.0,3.0,4.0,65,6.0,6.0,?,?,?,63,25,37,8,4.0,2.0,23,24,1.0,2.0,11.0,17.0,47,4.0,2.0,?,?,?
'Yanina Wickmayer','Alison Riske',2,0,0.0,2.0,63,13,37,6,3.0,3.0,14,30,0.0,2.0,3.0,7.0,36,1.0,1.0,?,?,?,78,27,22,6,4.0,2.0,15,8,5.0,10.0,2.0,3.0,60,6.0,6.0,?,?,?
'Flavia Pennetta','Monica Puig',2,1,2.0,0.0,45,22,55,18,9.0,0.0,21,14,2.0,6.0,4.0,4.0,67,6.0,6.0,?,?,?,45,21,55,16,5.0,6.0,19,38,0.0,0.0,11.0,16.0,50,3.0,4.0,?,?,?
'Mona Barthel','Luksika Kumkhum',2,1,2.0,1.0,63,44,37,18,3.0,6.0,25,33,4.0,5.0,11.0,20.0,92,4.0,6.0,6.0,?,?,58,38,42,13,4.0,8.0,37,39,3.0,7.0,7.0,8.0,94,6.0,3.0,4.0,?,?
'Jelena Jankovic','Ayumi Morita',2,1,2.0,0.0,59,19,41,7,9.0,4.0,25,14,6.0,6.0,0.0,1.0,53,6.0,6.0,?,?,?,57,8,43,5,1.0,3.0,7,18,1.0,1.0,1.0,2.0,26,2.0,0.0,?,?,?
'Kurumi Nara','Magdalena Rybarikova',2,1,2.0,0.0,66,26,34,15,0.0,2.0,8,26,4.0,4.0,5.0,10.0,59,6.0,6.0,?,?,?,52,16,48,8,4.0,1.0,13,38,2.0,5.0,7.0,11.0,51,4.0,3.0,?,?,?
'Marina Erakovic','Zarina Diyas',2,0,0.0,2.0,50,15,50,8,2.0,5.0,15,27,1.0,10.0,3.0,4.0,46,4.0,0.0,?,?,?,70,27,30,10,1.0,1.0,27,15,5.0,5.0,2.0,2.0,66,6.0,6.0,?,?,?
'Varvara Lepchenko','Simona Halep',2,0,1.0,2.0,63,34,37,10,1.0,4.0,23,47,2.0,2.0,9.0,10.0,66,6.0,0.0,1.0,?,?,58,29,42,16,0.0,3.0,10,19,6.0,15.0,1.0,2.0,90,4.0,6.0,6.0,?,?
'Carla Suarez Navarro','Galina Voskoboeva',2,1,2.0,1.0,73,57,27,17,0.0,5.0,19,30,6.0,10.0,14.0,19.0,126,7.0,3.0,8.0,?,?,55,40,45,23,3.0,13.0,50,67,7.0,17.0,25.0,39.0,121,6.0,6.0,6.0,?,?
'Stefanie Voegele','Dominika Cibulkova',2,0,0.0,2.0,42,11,58,1,3.0,1.0,12,22,1.0,5.0,2.0,3.0,30,0.0,1.0,?,?,?,68,21,32,8,0.0,2.0,17,13,6.0,9.0,4.0,5.0,55,6.0,6.0,?,?,?
'Alize Cornet','Camila Giorgi',2,1,2.0,1.0,59,39,41,17,1.0,9.0,5,29,6.0,13.0,2.0,6.0,103,6.0,4.0,6.0,?,?,56,31,44,20,0.0,12.0,28,73,5.0,12.0,19.0,33.0,92,3.0,6.0,4.0,?,?
'Karin Knapp','Maria Sharapova',2,1,2.0,1.0,53,40,47,23,3.0,9.0,20,55,6.0,9.0,6.0,7.0,112,3.0,6.0,8.0,?,?,60,44,40,23,2.0,12.0,34,67,7.0,20.0,6.0,6.0,124,6.0,4.0,1.0,?,?
'Agnieszka Radwanska','Olga Govortsova',2,1,2.0,0.0,66,28,34,8,1.0,1.0,18,13,5.0,8.0,11.0,14.0,63,6.0,7.0,?,?,?,70,20,30,6,0.0,1.0,18,26,1.0,2.0,13.0,18.0,43,0.0,5.0,?,?,?
'Mandy Minella','Anastasia Pavlyuchenkova',2,0,0.0,2.0,55,21,45,11,2.0,3.0,2,3,0.0,0.0,?,?,42,2.0,2.0,?,?,?,67,24,33,8,5.0,1.0,5,1,4.0,9.0,?,?,65,6.0,6.0,?,?,?
'Garbine Muguruza','Anna Schmiedlova',2,1,2.0,0.0,56,23,44,11,6.0,6.0,24,33,6.0,8.0,4.0,9.0,66,6.0,6.0,?,?,?,59,15,41,7,1.0,5.0,6,20,3.0,7.0,0.0,2.0,45,3.0,3.0,?,?,?
'Christina McHale','Caroline Wozniacki',2,0,1.0,2.0,53,22,47,12,3.0,3.0,17,37,3.0,6.0,2.0,2.0,61,0.0,6.0,2.0,?,?,74,30,26,8,2.0,3.0,15,29,5.0,12.0,11.0,15.0,70,6.0,1.0,6.0,?,?
'Sloane Stephens','Ajla Tomljanovic',2,1,2.0,1.0,71,39,29,14,3.0,3.0,25,36,5.0,10.0,10.0,13.0,92,3.0,6.0,7.0,?,?,54,35,46,22,3.0,6.0,25,44,3.0,6.0,8.0,16.0,87,6.0,2.0,5.0,?,?
'Olivia Rogowska','Elina Svitolina',2,0,0.0,2.0,61,26,39,14,5.0,2.0,22,36,3.0,5.0,8.0,10.0,65,4.0,5.0,?,?,?,53,26,47,15,7.0,3.0,19,24,5.0,8.0,8.0,11.0,76,6.0,7.0,?,?,?
'Bojana Jovanovski','Yvonne Meusburger',2,0,1.0,2.0,69,30,31,14,?,1.0,32,50,6.0,9.0,7.0,9.0,85,6.0,3.0,2.0,?,?,67,38,33,5,?,5.0,18,34,8.0,15.0,9.0,12.0,92,3.0,6.0,6.0,?,?
'Barbora Zahlavova Strycova','Victoria Azarenka',2,0,0.0,2.0,55,13,45,9,1.0,2.0,17,30,2.0,8.0,17.0,27.0,50,1.0,4.0,?,?,?,85,34,15,6,0.0,1.0,15,18,5.0,11.0,10.0,19.0,65,6.0,6.0,?,?,?
'Serena Williams','Daniela Hantuchova',3,1,2.0,0.0,48,20,52,15,10.0,2.0,25,21,4.0,7.0,4.0,12.0,60,6.0,6.0,?,?,?,54,15,46,12,2.0,2.0,10,19,1.0,6.0,1.0,3.0,48,3.0,3.0,?,?,?
'Samantha Stosur','Ana Ivanovic',3,0,1.0,2.0,68,42,32,22,3.0,2.0,21,30,1.0,4.0,11.0,16.0,93,7.0,4.0,2.0,?,?,58,47,42,23,6.0,3.0,46,40,4.0,9.0,16.0,23.0,107,6.0,6.0,6.0,?,?
'Jie Zheng','Casey Dellacqua',3,0,0.0,2.0,64,18,36,11,0.0,5.0,15,28,2.0,3.0,2.0,4.0,45,2.0,4.0,?,?,?,58,20,42,14,1.0,3.0,14,16,5.0,10.0,3.0,4.0,64,6.0,6.0,?,?,?
'Eugenie Bouchard','Lauren Davis',3,1,2.0,0.0,61,23,39,10,4.0,2.0,18,23,5.0,8.0,3.0,5.0,67,6.0,6.0,?,?,?,77,24,23,3,0.0,1.0,7,31,1.0,3.0,3.0,4.0,43,2.0,2.0,?,?,?
'Na Li','Lucie Safarova',3,1,2.0,1.0,60,43,40,18,5.0,6.0,17,50,4.0,10.0,8.0,9.0,99,1.0,7.0,6.0,?,?,59,33,41,17,2.0,7.0,21,43,6.0,16.0,5.0,6.0,99,6.0,6.0,3.0,?,?
'Ekaterina Makarova','Monica Niculescu',3,1,2.0,0.0,56,17,44,13,2.0,1.0,17,35,6.0,9.0,9.0,10.0,65,6.0,6.0,?,?,?,70,23,30,8,1.0,3.0,9,34,4.0,4.0,4.0,11.0,56,4.0,4.0,?,?,?
'Angelique Kerber','Alison Riske',3,1,2.0,0.0,63,21,37,6,4.0,4.0,21,16,7.0,13.0,6.0,9.0,64,6.0,6.0,?,?,?,62,16,38,8,0.0,6.0,18,29,4.0,5.0,8.0,23.0,48,3.0,4.0,?,?,?
'Flavia Pennetta','Mona Barthel',3,1,2.0,0.0,44,17,56,15,3.0,4.0,14,10,6.0,15.0,3.0,5.0,70,6.0,7.0,?,?,?,60,22,40,13,4.0,6.0,22,45,2.0,4.0,6.0,10.0,55,1.0,5.0,?,?,?
'Jelena Jankovic','Kurumi Nara',3,1,2.0,0.0,62,23,38,13,1.0,3.0,12,33,7.0,9.0,5.0,10.0,72,6.0,7.0,?,?,?,86,25,14,5,0.0,2.0,19,43,5.0,7.0,13.0,18.0,63,4.0,5.0,?,?,?
'Zarina Diyas','Simona Halep',3,0,0.0,2.0,61,16,39,7,0.0,3.0,9,32,2.0,4.0,7.0,9.0,42,1.0,4.0,?,?,?,52,18,48,13,1.0,3.0,18,20,6.0,6.0,3.0,6.0,62,6.0,6.0,?,?,?
'Carla Suarez Navarro','Dominika Cibulkova',3,0,0.0,2.0,65,12,35,4,0.0,0.0,2,23,0.0,1.0,0.0,3.0,26,1.0,0.0,?,?,?,69,21,31,8,1.0,1.0,20,20,5.0,9.0,7.0,9.0,56,6.0,6.0,?,?,?
'Alize Cornet','Maria Sharapova',3,0,0.0,2.0,65,24,35,9,?,5.0,11,23,4.0,6.0,7.0,12.0,60,1.0,6.0,?,?,?,50,23,50,16,?,8.0,35,35,6.0,14.0,12.0,13.0,81,6.0,7.0,?,?,?
'Agnieszka Radwanska','Anastasia Pavlyuchenkova',3,1,2.0,1.0,65,36,35,16,5.0,2.0,25,19,6.0,9.0,13.0,20.0,96,5.0,6.0,6.0,?,?,59,29,41,17,0.0,7.0,39,49,3.0,5.0,12.0,21.0,78,7.0,2.0,2.0,?,?
'Garbine Muguruza','Caroline Wozniacki',3,1,2.0,1.0,64,37,36,16,5.0,7.0,33,56,7.0,10.0,12.0,17.0,96,4.0,7.0,6.0,?,?,67,39,33,12,2.0,6.0,17,37,5.0,16.0,9.0,13.0,93,6.0,5.0,3.0,?,?
'Sloane Stephens','Elina Svitolina',3,1,2.0,0.0,69,31,31,10,1.0,0.0,24,32,4.0,9.0,10.0,13.0,68,7.0,6.0,?,?,?,57,23,43,15,0.0,4.0,12,27,2.0,3.0,9.0,17.0,61,5.0,4.0,?,?,?
'Yvonne Meusburger','Victoria Azarenka',3,0,0.0,2.0,70,8,30,4,?,5.0,5,18,1.0,2.0,3.0,3.0,25,1.0,0.0,?,?,?,74,20,26,5,?,2.0,20,13,7.0,14.0,14.0,17.0,56,6.0,6.0,?,?,?
'Serena Williams','Ana Ivanovic',4,0,1.0,2.0,66,43,34,13,13.0,4.0,22,31,2.0,3.0,10.0,15.0,79,6.0,3.0,3.0,?,?,53,31,47,21,1.0,2.0,33,27,4.0,14.0,10.0,13.0,91,4.0,6.0,6.0,?,?
'Casey Dellacqua','Eugenie Bouchard',4,0,1.0,2.0,61,33,39,14,0.0,3.0,11,47,1.0,2.0,5.0,9.0,68,7.0,2.0,0.0,?,?,65,37,35,16,6.0,1.0,29,28,6.0,11.0,10.0,12.0,94,6.0,6.0,6.0,?,?
'Na Li','Ekaterina Makarova',4,1,2.0,0.0,80,26,20,4,1.0,1.0,18,14,5.0,7.0,8.0,14.0,55,6.0,6.0,?,?,?,64,14,36,3,0.0,1.0,4,11,0.0,4.0,3.0,4.0,31,2.0,0.0,?,?,?
'Angelique Kerber','Flavia Pennetta',4,0,1.0,2.0,64,35,36,10,1.0,4.0,25,35,5.0,6.0,5.0,13.0,77,1.0,6.0,5.0,?,?,60,33,40,12,8.0,2.0,43,37,8.0,18.0,17.0,27.0,98,6.0,4.0,7.0,?,?
'Jelena Jankovic','Simona Halep',4,0,1.0,2.0,67,32,33,11,2.0,2.0,23,43,4.0,8.0,20.0,30.0,69,4.0,6.0,0.0,?,?,64,26,36,14,0.0,4.0,22,28,6.0,13.0,4.0,4.0,81,6.0,2.0,6.0,?,?
'Dominika Cibulkova','Maria Sharapova',4,1,2.0,1.0,69,27,31,13,1.0,5.0,16,28,7.0,14.0,2.0,2.0,87,3.0,6.0,6.0,?,?,66,31,34,12,3.0,8.0,27,45,5.0,10.0,8.0,10.0,77,6.0,4.0,1.0,?,?
'Agnieszka Radwanska','Garbine Muguruza',4,1,2.0,0.0,73,34,27,11,2.0,1.0,9,15,4.0,9.0,4.0,7.0,76,6.0,6.0,?,?,?,56,18,44,10,3.0,3.0,23,44,0.0,6.0,6.0,14.0,49,1.0,3.0,?,?,?
'Sloane Stephens','Victoria Azarenka',4,0,0.0,2.0,72,24,28,9,0.0,0.0,20,32,0.0,2.0,6.0,8.0,55,3.0,2.0,?,?,?,69,32,31,10,3.0,7.0,20,20,3.0,14.0,13.0,17.0,74,6.0,6.0,?,?,?
'Ana Ivanovic','Eugenie Bouchard',5,0,1.0,2.0,56,34,44,23,1.0,4.0,34,35,5.0,12.0,12.0,18.0,104,7.0,5.0,2.0,?,?,58,42,42,20,2.0,6.0,47,37,7.0,13.0,19.0,24.0,113,5.0,7.0,6.0,?,?
'Na Li','Flavia Pennetta',5,1,2.0,0.0,64,23,36,10,1.0,1.0,23,17,5.0,8.0,7.0,10.0,62,6.0,6.0,?,?,?,39,12,61,13,3.0,5.0,14,27,1.0,4.0,2.0,2.0,37,2.0,2.0,?,?,?
'Simona Halep','Dominika Cibulkova',5,0,0.0,2.0,67,13,33,6,2.0,1.0,9,25,1.0,3.0,1.0,4.0,32,3.0,0.0,?,?,?,77,25,23,5,0.0,3.0,17,16,5.0,9.0,3.0,4.0,54,6.0,6.0,?,?,?
'Agnieszka Radwanska','Victoria Azarenka',5,1,2.0,1.0,59,33,41,16,1.0,1.0,23,15,6.0,16.0,19.0,24.0,94,6.0,5.0,6.0,?,?,60,26,40,19,0.0,5.0,33,47,2.0,5.0,20.0,34.0,74,1.0,7.0,0.0,?,?
'Eugenie Bouchard','Na Li',6,0,0.0,2.0,45,13,55,5,2.0,2.0,10,14,3.0,7.0,4.0,5.0,49,2.0,4.0,?,?,?,61,27,39,11,4.0,5.0,35,23,6.0,10.0,11.0,14.0,71,6.0,6.0,?,?,?
'Dominika Cibulkova','Agnieszka Radwanska',6,1,2.0,0.0,64,22,36,10,0.0,2.0,21,20,6.0,9.0,12.0,14.0,63,6.0,6.0,?,?,?,68,17,32,2,2.0,2.0,12,24,1.0,9.0,4.0,9.0,40,1.0,2.0,?,?,?
'Na Li','Dominika Cibulkova',7,1,2.0,0.0,60,21,40,15,2.0,3.0,34,30,5.0,10.0,8.0,13.0,75,7.0,6.0,?,?,?,67,29,33,5,0.0,7.0,11,28,2.0,3.0,3.0,4.0,58,6.0,0.0,?,?,?
