{
  "data_set_description": {
    "citation": "https://archive.ics.uci.edu/ml/citation_policy.html",
    "collection_date": "01-06-2014",
    "creator": [
      "Shruti Jauhari",
      "Aniket Morankar",
      "Ernest Fokoue"
    ],
    "description": "**Author**: Shruti Jauhari, Aniket Morankar, Ernest Fokoue\n**Source**: [UCI](https://archive.ics.uci.edu/ml/datasets/Tennis+Major+Tournament+Match+Statistics) - 2014\n**Please cite**: [UCI](https://archive.ics.uci.edu/ml/citation_policy.html)  \n\n\n**Tennis Major Tournament Match Statistics - Wimbledon Men 2013**\n\nThis is a part of collection of 8 files containing the match statistics for both women and men at the four major tennis tournaments of the year 2013. Each file has 42 columns and a minimum of 76 rows. This file contains the statistics for the Wimbledon Men's Edition for 2013.\n\n### Attribute information\n\n- Player 1 Name of Player 1 \n- Player 2 Name of Player 2 \nResult Result of the match (0/1) - Referenced on Player 1 is Result = 1 if Player 1 wins (FNL.1>FNL.2) \n- FSP.1 First Serve Percentage for player 1 (Real Number) \n- FSW.1 First Serve Won by player 1 (Real Number) \n- SSP.1 Second Serve Percentage for player 1 (Real Number) \n- SSW.1 Second Serve Won by player 1 (Real Number) \n- ACE.1 Aces won by player 1 (Numeric-Integer) \n- DBF.1 Double Faults committed by player 1 (Numeric-Integer) \n- WNR.1 Winners earned by player 1 (Numeric) \n- UFE.1 Unforced Errors committed by player 1 (Numeric) \n- BPC.1 Break Points Created by player 1 (Numeric) \n- BPW.1 Break Points Won by player 1 (Numeric) \n- NPA.1 Net Points Attempted by player 1 (Numeric) \n- NPW.1 Net Points Won by player 1 (Numeric) \n- TPW.1 Total Points Won by player 1 (Numeric) \n- ST1.1 Set 1 result for Player 1 (Numeric-Integer) \n- ST2.1 Set 2 Result for Player 1 (Numeric-Integer) \n- ST3.1 Set 3 Result for Player 1 (Numeric-Integer) \n- ST4.1 Set 4 Result for Player 1 (Numeric-Integer) \n- ST5.1 Set 5 Result for Player 1 (Numeric-Integer) \n- FNL.1 Final Number of Games Won by Player 1 (Numeric-Integer) \n- FSP.2 First Serve Percentage for player 2 (Real Number) \n- FSW.2 First Serve Won by player 2 (Real Number) \n- SSP.2 Second Serve Percentage for player 2 (Real Number) \n- SSW.2 Second Serve Won by player 2 (Real Number) \n- ACE.2 Aces won by player 2 (Numeric-Integer) \n- DBF.2 Double Faults committed by player 2 (Numeric-Integer) \n- WNR.2 Winners earned by player 2 (Numeric) \n- UFE.2 Unforced Errors committed by player 2 (Numeric) \n- BPC.2 Break Points Created by player 2 (Numeric) \n- BPW.2 Break Points Won by player 2 (Numeric) \n- NPA.2 Net Points Attempted by player 2 (Numeric) \n- NPW.2 Net Points Won by player 2 (Numeric) \n- TPW.2 Total Points Won by player 2 (Numeric) \n- ST1.2 Set 1 result for Player 2 (Numeric-Integer) \n- ST2.2 Set 2 Result for Player 2 (Numeric-Integer) \n- ST3.2 Set 3 Result for Player 2 (Numeric-Integer) \n- ST4.2 Set 4 Result for Player 2 (Numeric-Integer) \n- ST5.2 Set 5 Result for Player 2 (Numeric-Integer) \n- FNL.2 Final Number of Games Won by Player 2 (Numeric-Integer) \n- Round Round of the tournament at which game is played (Numeric-Integer)",
    "description_version": "3",
    "file_id": "22045634",
    "format": "arff",
    "id": "42965",
    "language": "English",
    "licence": "Publicly available",
    "md5_checksum": "4c5c38b25fe6482def15dec24444e13c",
    "minio_url": "https://data.openml.org/datasets/0004/42965/dataset_42965.pq",
    "name": "wimbledon-men-2013",
    "original_data_url": "https://archive.ics.uci.edu/ml/datasets/Tennis+Major+Tournament+Match+Statistics",
    "parquet_url": "https://data.openml.org/datasets/0004/42965/dataset_42965.pq",
    "processing_date": "2021-05-28 10:44:05",
    "status": "active",
    "upload_date": "2021-05-28T10:43:54",
    "url": "https://api.openml.org/data/v1/download/22045634/wimbledon-men-2013.arff",
    "version": "1",
    "version_label": "1",
    "visibility": "public"
  }
}