{
  "data_set_description": {
    "citation": "dgf test",
    "collection_date": "20-05-2021",
    "contributor": "dgml_test",
    "creator": "dgml_test",
    "default_target_attribute": "io",
    "description": "airbnb bordeaux",
    "description_version": "1",
    "file_id": "22045560",
    "format": "arff",
    "id": "42927",
    "language": "French",
    "licence": "Undefined",
    "md5_checksum": "26730f72462f7f2364968385d3ffab16",
    "minio_url": "http://openml1.win.tue.nl/dataset42927/dataset_42927.pq",
    "name": "dgf_123e1c18-37e0-4147-ad65-768320387800",
    "processing_date": "2021-05-20 18:40:02",
    "status": "active",
    "upload_date": "2021-05-20T18:39:49",
    "url": "https://www.openml.org/data/v1/download/22045560/dgf_123e1c18-37e0-4147-ad65-768320387800.arff",
    "version": "1",
    "version_label": "example",
    "visibility": "public"
  }
}