{
  "data_features": {
    "feature": [
      {
        "data_type": "nominal",
        "index": "0",
        "is_ignore": "false",
        "is_row_identifier": "false",
        "is_target": "false",
        "name": "Gender",
        "nominal_value": [
          "male",
          "female"
        ],
        "number_of_missing_values": "0"
      },
      {
        "data_type": "numeric",
        "index": "1",
        "is_ignore": "false",
        "is_row_identifier": "false",
        "is_target": "false",
        "name": "Age",
        "number_of_missing_values": "0"
      },
      {
        "data_type": "nominal",
        "index": "2",
        "is_ignore": "false",
        "is_row_identifier": "false",
        "is_target": "false",
        "name": "d 5100-0",
        "nominal_value": [
          "false",
          "true"
        ],
        "number_of_missing_values": "0"
      },
      {
        "data_type": "nominal",
        "index": "3",
        "is_ignore": "false",
        "is_row_identifier": "false",
        "is_target": "false",
        "name": "d 5100-1",
        "nominal_value": [
          "false",
          "true"
        ],
        "number_of_missing_values": "0"
      },
      {
        "data_type": "nominal",
        "index": "4",
        "is_ignore": "false",
        "is_row_identifier": "false",
        "is_target": "false",
        "name": "d 5100-2",
        "nominal_value": [
          "false",
          "true"
        ],
        "number_of_missing_values": "0"
      },
      {
        "data_type": "nominal",
        "index": "5",
        "is_ignore": "false",
        "is_row_identifier": "false",
        "is_target": "false",
        "name": "d 5100-3",
        "nominal_value": [
          "false",
          "true"
        ],
        "number_of_missing_values": "0"
      },
      {
        "data_type": "nominal",
        "index": "6",
        "is_ignore": "false",
        "is_row_identifier": "false",
        "is_target": "false",
        "name": "d 5100-4",
        "nominal_value": [
          "false",
          "true"
        ],
        "number_of_missing_values": "0"
      },
      {
        "data_type": "nominal",
        "index": "7",
        "is_ignore": "false",
        "is_row_identifier": "false",
        "is_target": "false",
        "name": "d 5100-8",
        "nominal_value": [
          "false",
          "true"
        ],
        "number_of_missing_values": "0"
      },
      {
        "data_type": "nominal",
        "index": "8",
        "is_ignore": "false",
        "is_row_identifier": "false",
        "is_target": "false",
        "name": "d 5100-9",
        "nominal_value": [
          "false",
          "true"
        ],
        "number_of_missing_values": "0"
      },
      {
        "data_type": "nominal",
        "index": "9",
        "is_ignore": "false",
        "is_row_identifier": "false",
        "is_target": "false",
        "name": "d 5101-0",
        "nominal_value": [
          "false",
          "true"
        ],
        "number_of_missing_values": "0"
      },
      {
        "data_type": "nominal",
        "index": "10",
        "is_ignore": "false",
        "is_row_identifier": "false",
        "is_target": "false",
        "name": "d 5101-1",
        "nominal_value": [
          "false",
          "true"
        ],
        "number_of_missing_values": "0"
      },
      {
        "data_type": "nominal",
        "index": "11",
        "is_ignore": "false",
        "is_row_identifier": "false",
        "is_target": "false",
        "name": "d 5101-2",
        "nominal_value": [
          "false",
          "true"
        ],
        "number_of_missing_values": "0"
      },
      {
        "data_type": "nominal",
        "index": "12",
        "is_ignore": "false",
        "is_row_identifier": "false",
        "is_target": "false",
        "name": "d 5101-3",
        "nominal_value": [
          "false",
          "true"
        ],
        "number_of_missing_values": "0"
      },
      {
        "data_type": "nominal",
        "index": "13",
        "is_ignore": "false",
        "is_row_identifier": "false",
        "is_target": "false",
        "name": "d 5101-4",
        "nominal_value": [
          "false",
          "true"
        ],
        "number_of_missing_values": "0"
      },
      {
        "data_type": "nominal",
        "index": "14",
        "is_ignore": "false",
        "is_row_identifier": "false",
        "is_target": "false",
        "name": "d 5101-8",
        "nominal_value": [
          "false",
          "true"
        ],
        "number_of_missing_values": "0"
      },
      {
        "data_type": "nominal",
        "index": "15",
        "is_ignore": "false",
        "is_row_identifier": "false",
        "is_target": "false",
        "name": "d 5101-9",
        "nominal_value": [
          "false",
          "true"
        ],
        "number_of_missing_values": "0"
      },
      {
        "data_type": "nominal",
        "index": "16",
        "is_ignore": "false",
        "is_row_identifier": "false",
        "is_target": "false",
        "name": "d 5102-0",
        "nominal_value": [
          "false",
          "true"
        ],
        "number_of_missing_values": "0"
      },
      {
        "data_type": "nominal",
        "index": "17",
        "is_ignore": "false",
        "is_row_identifier": "false",
        "is_target": "false",
        "name": "d 5102-1",
        "nominal_value": [
          "false",
          "true"
        ],
        "number_of_missing_values": "0"
      },
      {
        "data_type": "nominal",
        "index": "18",
        "is_ignore": "false",
        "is_row_identifier": "false",
        "is_target": "false",
        "name": "d 5102-2",
        "nominal_value": [
          "false",
          "true"
        ],
        "number_of_missing_values": "0"
      },
      {
        "data_type": "nominal",
        "index": "19",
        "is_ignore": "false",
        "is_row_identifier": "false",
        "is_target": "false",
        "name": "d 5102-3",
        "nominal_value": [
          "false",
          "true"
        ],
        "number_of_missing_values": "0"
      },
      {
        "data_type": "nominal",
        "index": "20",
        "is_ignore": "false",
        "is_row_identifier": "false",
        "is_target": "false",
        "name": "d 5102-4",
        "nominal_value": [
          "false",
          "true"
        ],
        "number_of_missing_values": "0"
      },
      {
        "data_type": "nominal",
        "index": "21",
        "is_ignore": "false",
        "is_row_identifier": "false",
        "is_target": "false",
        "name": "d 5102-8",
        "nominal_value": [
          "false",
          "true"
        ],
        "number_of_missing_values": "0"
      },
      {
        "data_type": "nominal",
        "index": "22",
        "is_ignore": "false",
        "is_row_identifier": "false",
        "is_target": "false",
        "name": "d 5102-9",
        "nominal_value": [
          "false",
          "true"
        ],
        "number_of_missing_values": "0"
      },
      {
        "data_type": "nominal",
        "index": "23",
        "is_ignore": "false",
        "is_row_identifier": "false",
        "is_target": "false",
        "name": "d 5200-0",
        "nominal_value": [
          "false",
          "true"
        ],
        "number_of_missing_values": "0"
      },
      {
        "data_type": "nominal",
        "index": "24",
        "is_ignore": "false",
        "is_row_identifier": "false",
        "is_target": "false",
        "name": "d 5200-1",
        "nominal_value": [
          "false",
          "true"
        ],
        "number_of_missing_values": "0"
      },
      {
        "data_type": "nominal",
        "index": "25",
        "is_ignore": "false",
        "is_row_identifier": "false",
        "is_target": "false",
        "name": "d 5200-2",
        "nominal_value": [
          "false",
          "true"
        ],
        "number_of_missing_values": "0"
      },
      {
        "data_type": "nominal",
        "index": "26",
        "is_ignore": "false",
        "is_row_identifier": "false",
        "is_target": "false",
        "name": "d 5200-3",
        "nominal_value": [
          "false",
          "true"
        ],
        "number_of_missing_values": "0"
      },
      {
        "data_type": "nominal",
        "index": "27",
        "is_ignore": "false",
        "is_row_identifier": "false",
        "is_target": "false",
        "name": "d 5200-4",
        "nominal_value": [
          "false",
          "true"
        ],
        "number_of_missing_values": "0"
      },
      {
        "data_type": "nominal",
        "index": "28",
        "is_ignore": "false",
        "is_row_identifier": "false",
        "is_target": "false",
        "name": "d 5200-8",
        "nominal_value": [
          "false",
          "true"
        ],
        "number_of_missing_values": "0"
      },
      {
        "data_type": "nominal",
        "index": "29",
        "is_ignore": "false",
        "is_row_identifier": "false",
        "is_target": "false",
        "name": "d 5200-9",
        "nominal_value": [
          "false",
          "true"
        ],
        "number_of_missing_values": "0"
      },
      {
        "data_type": "nominal",
        "index": "30",
        "is_ignore": "false",
        "is_row_identifier": "false",
        "is_target": "false",
        "name": "d 5201-0",
        "nominal_value": [
          "false",
          "true"
        ],
        "number_of_missing_values": "0"
      },
      {
        "data_type": "nominal",
        "index": "31",
        "is_ignore": "false",
        "is_row_identifier": "false",
        "is_target": "false",
        "name": "d 5201-1",
        "nominal_value": [
          "false",
          "true"
        ],
        "number_of_missing_values": "0"
      },
      {
        "data_type": "nominal",
        "index": "32",
        "is_ignore": "false",
        "is_row_identifier": "false",
        "is_target": "false",
        "name": "d 5201-2",
        "nominal_value": [
          "false",
          "true"
        ],
        "number_of_missing_values": "0"
      },
      {
        "data_type": "nominal",
        "index": "33",
        "is_ignore": "false",
        "is_row_identifier": "false",
        "is_target": "false",
        "name": "d 5201-3",
        "nominal_value": [
          "false",
          "true"
        ],
        "number_of_missing_values": "0"
      },
      {
        "data_type": "nominal",
        "index": "34",
        "is_ignore": "false",
        "is_row_identifier": "false",
        "is_target": "false",
        "name": "d 5201-4",
        "nominal_value": [
          "false",
          "true"
        ],
        "number_of_missing_values": "0"
      },
      {
        "data_type": "nominal",
        "index": "35",
        "is_ignore": "false",
        "is_row_identifier": "false",
        "is_target": "false",
        "name": "d 5201-8",
        "nominal_value": [
          "false",
          "true"
        ],
        "number_of_missing_values": "0"
      },
      {
        "data_type": "nominal",
        "index": "36",
        "is_ignore": "false",
        "is_row_identifier": "false",
        "is_target": "false",
        "name": "d 5201-9",
        "nominal_value": [
          "false",
          "true"
        ],
        "number_of_missing_values": "0"
      },
      {
        "data_type": "nominal",
        "index": "37",
        "is_ignore": "false",
        "is_row_identifier": "false",
        "is_target": "false",
        "name": "d 5202-0",
        "nominal_value": [
          "false",
          "true"
        ],
        "number_of_missing_values": "0"
      },
      {
        "data_type": "nominal",
        "index": "38",
        "is_ignore": "false",
        "is_row_identifier": "false",
        "is_target": "false",
        "name": "d 5202-1",
        "nominal_value": [
          "false",
          "true"
        ],
        "number_of_missing_values": "0"
      },
      {
        "data_type": "nominal",
        "index": "39",
        "is_ignore": "false",
        "is_row_identifier": "false",
        "is_target": "false",
        "name": "d 5202-2",
        "nominal_value": [
          "false",
          "true"
        ],
        "number_of_missing_values": "0"
      },
      {
        "data_type": "nominal",
        "index": "40",
        "is_ignore": "false",
        "is_row_identifier": "false",
        "is_target": "false",
        "name": "d 5202-3",
        "nominal_value": [
          "false",
          "true"
        ],
        "number_of_missing_values": "0"
      },
      {
        "data_type": "nominal",
        "index": "41",
        "is_ignore": "false",
        "is_row_identifier": "false",
        "is_target": "false",
        "name": "d 5202-4",
        "nominal_value": [
          "false",
          "true"
        ],
        "number_of_missing_values": "0"
      },
      {
        "data_type": "nominal",
        "index": "42",
        "is_ignore": "false",
        "is_row_identifier": "false",
        "is_target": "false",
        "name": "d 5202-8",
        "nominal_value": [
          "false",
          "true"
        ],
        "number_of_missing_values": "0"
      },
      {
        "data_type": "nominal",
        "index": "43",
        "is_ignore": "false",
        "is_row_identifier": "false",
        "is_target": "false",
        "name": "d 5202-9",
        "nominal_value": [
          "false",
          "true"
        ],
        "number_of_missing_values": "0"
      },
      {
        "data_type": "nominal",
        "index": "44",
        "is_ignore": "false",
        "is_row_identifier": "false",
        "is_target": "false",
        "name": "d 5203-0",
        "nominal_value": [
          "false",
          "true"
        ],
        "number_of_missing_values": "0"
      },
      {
        "data_type": "nominal",
        "index": "45",
        "is_ignore": "false",
        "is_row_identifier": "false",
        "is_target": "false",
        "name": "d 5203-1",
        "nominal_value": [
          "false",
          "true"
        ],
        "number_of_missing_values": "0"
      },
      {
        "data_type": "nominal",
        "index": "46",
        "is_ignore": "false",
        "is_row_identifier": "false",
        "is_target": "false",
        "name": "d 5203-2",
        "nominal_value": [
          "false",
          "true"
        ],
        "number_of_missing_values": "0"
      },
      {
        "data_type": "nominal",
        "index": "47",
        "is_ignore": "false",
        "is_row_identifier": "false",
        "is_target": "false",
        "name": "d 5203-3",
        "nominal_value": [
          "false",
          "true"
        ],
        "number_of_missing_values": "0"
      },
      {
        "data_type": "nominal",
        "index": "48",
        "is_ignore": "false",
        "is_row_identifier": "false",
        "is_target": "false",
        "name": "d 5203-4",
        "nominal_value": [
          "false",
          "true"
        ],
        "number_of_missing_values": "0"
      },
      {
        "data_type": "nominal",
        "index": "49",
        "is_ignore": "false",
        "is_row_identifier": "false",
        "is_target": "false",
        "name": "d 5203-8",
        "nominal_value": [
          "false",
          "true"
        ],
        "number_of_missing_values": "0"
      },
      {
        "data_type": "nominal",
        "index": "50",
        "is_ignore": "false",
        "is_row_identifier": "false",
        "is_target": "false",
        "name": "d 5203-9",
        "nominal_value": [
          "false",
          "true"
        ],
        "number_of_missing_values": "0"
      },
      {
        "data_type": "nominal",
        "index": "51",
        "is_ignore": "false",
        "is_row_identifier": "false",
        "is_target": "false",
        "name": "d 5204-0",
        "nominal_value": [
          "false",
          "true"
        ],
        "number_of_missing_values": "0"
      },
      {
        "data_type": "nominal",
        "index": "52",
        "is_ignore": "false",
        "is_row_identifier": "false",
        "is_target": "false",
        "name": "d 5204-1",
        "nominal_value": [
          "false",
          "true"
        ],
        "number_of_missing_values": "0"
      },
      {
        "data_type": "nominal",
        "index": "53",
        "is_ignore": "false",
        "is_row_identifier": "false",
        "is_target": "false",
        "name": "d 5204-2",
        "nominal_value": [
          "false",
          "true"
        ],
        "number_of_missing_values": "0"
      },
      {
        "data_type": "nominal",
        "index": "54",
        "is_ignore": "false",
        "is_row_identifier": "false",
        "is_target": "false",
        "name": "d 5204-3",
        "nominal_value": [
          "false",
          "true"
        ],
        "number_of_missing_values": "0"
      },
      {
        "data_type": "nominal",
        "index": "55",
        "is_ignore": "false",
        "is_row_identifier": "false",
        "is_target": "false",
        "name": "d 5204-4",
        "nominal_value": [
          "false",
          "true"
        ],
        "number_of_missing_values": "0"
      },
      {
        "data_type": "nominal",
        "index": "56",
        "is_ignore": "false",
        "is_row_identifier": "false",
        "is_target": "false",
        "name": "d 5204-8",
        "nominal_value": [
          "false",
          "true"
        ],
        "number_of_missing_values": "0"
      },
      {
        "data_type": "nominal",
        "index": "57",
        "is_ignore": "false",
        "is_row_identifier": "false",
        "is_target": "false",
        "name": "d 5204-9",
        "nominal_value": [
          "false",
          "true"
        ],
        "number_of_missing_values": "0"
      },
      {
        "data_type": "nominal",
        "index": "58",
        "is_ignore": "false",
        "is_row_identifier": "false",
        "is_target": "false",
        "name": "d 5205-0",
        "nominal_value": [
          "false",
          "true"
        ],
        "number_of_missing_values": "0"
      },
      {
        "data_type": "nominal",
        "index": "59",
        "is_ignore": "false",
        "is_row_identifier": "false",
        "is_target": "false",
        "name": "d 5205-1",
        "nominal_value": [
          "false",
          "true"
        ],
        "number_of_missing_values": "0"
      },
      {
        "data_type": "nominal",
        "index": "60",
        "is_ignore": "false",
        "is_row_identifier": "false",
        "is_target": "false",
        "name": "d 5205-2",
        "nominal_value": [
          "false",
          "true"
        ],
        "number_of_missing_values": "0"
      },
      {
        "data_type": "nominal",
        "index": "61",
        "is_ignore": "false",
        "is_row_identifier": "false",
        "is_target": "false",
        "name": "d 5205-3",
        "nominal_value": [
          "false",
          "true"
        ],
        "number_of_missing_values": "0"
      },
      {
        "data_type": "nominal",
        "index": "62",
        "is_ignore": "false",
        "is_row_identifier": "false",
        "is_target": "false",
        "name": "d 5205-4",
        "nominal_value": [
          "false",
          "true"
        ],
        "number_of_missing_values": "0"
      },
      {
        "data_type": "nominal",
        "index": "63",
        "is_ignore": "false",
        "is_row_identifier": "false",
        "is_target": "false",
        "name": "d 5205-8",
        "nominal_value": [
          "false",
          "true"
        ],
        "number_of_missing_values": "0"
      },
      {
        "data_type": "nominal",
        "index": "64",
        "is_ignore": "false",
        "is_row_identifier": "false",
        "is_target": "false",
        "name": "d 5205-9",
        "nominal_value": [
          "false",
          "true"
        ],
        "number_of_missing_values": "0"
      },
      {
        "data_type": "nominal",
        "index": "65",
        "is_ignore": "false",
        "is_row_identifier": "false",
        "is_target": "false",
        "name": "d 53000-0",
        "nominal_value": [
          "false",
          "true"
        ],
        "number_of_missing_values": "0"
      },
      {
        "data_type": "nominal",
        "index": "66",
        "is_ignore": "false",
        "is_row_identifier": "false",
        "is_target": "false",
        "name": "d 53000-1",
        "nominal_value": [
          "false",
          "true"
        ],
        "number_of_missing_values": "0"
      },
      {
        "data_type": "nominal",
        "index": "67",
        "is_ignore": "false",
        "is_row_identifier": "false",
        "is_target": "false",
        "name": "d 53000-2",
        "nominal_value": [
          "false",
          "true"
        ],
        "number_of_missing_values": "0"
      },
      {
        "data_type": "nominal",
        "index": "68",
        "is_ignore": "false",
        "is_row_identifier": "false",
        "is_target": "false",
        "name": "d 53000-3",
        "nominal_value": [
          "false",
          "true"
        ],
        "number_of_missing_values": "0"
      },
      {
        "data_type": "nominal",
        "index": "69",
        "is_ignore": "false",
        "is_row_identifier": "false",
        "is_target": "false",
        "name": "d 53000-4",
        "nominal_value": [
          "false",
          "true"
        ],
        "number_of_missing_values": "0"
      },
      {
        "data_type": "nominal",
        "index": "70",
        "is_ignore": "false",
        "is_row_identifier": "false",
        "is_target": "false",
        "name": "d 53000-8",
        "nominal_value": [
          "false",
          "true"
        ],
        "number_of_missing_values": "0"
      },
      {
        "data_type": "nominal",
        "index": "71",
        "is_ignore": "false",
        "is_row_identifier": "false",
        "is_target": "false",
        "name": "d 53000-9",
        "nominal_value": [
          "false",
          "true"
        ],
        "number_of_missing_values": "0"
      },
      {
        "data_type": "nominal",
        "index": "72",
        "is_ignore": "false",
        "is_row_identifier": "false",
        "is_target": "false",
        "name": "d 53001-0",
        "nominal_value": [
          "false",
          "true"
        ],
        "number_of_missing_values": "0"
      },
      {
        "data_type": "nominal",
        "index": "73",
        "is_ignore": "false",
        "is_row_identifier": "false",
        "is_target": "false",
        "name": "d 53001-1",
        "nominal_value": [
          "false",
          "true"
        ],
        "number_of_missing_values": "0"
      },
      {
        "data_type": "nominal",
        "index": "74",
        "is_ignore": "false",
        "is_row_identifier": "false",
        "is_target": "false",
        "name": "d 53001-2",
        "nominal_value": [
          "false",
          "true"
        ],
        "number_of_missing_values": "0"
      },
      {
        "data_type": "nominal",
        "index": "75",
        "is_ignore": "false",
        "is_row_identifier": "false",
        "is_target": "false",
        "name": "d 53001-3",
        "nominal_value": [
          "false",
          "true"
        ],
        "number_of_missing_values": "0"
      },
      {
        "data_type": "nominal",
        "index": "76",
        "is_ignore": "false",
        "is_row_identifier": "false",
        "is_target": "false",
        "name": "d 53001-4",
        "nominal_value": [
          "false",
          "true"
        ],
        "number_of_missing_values": "0"
      },
      {
        "data_type": "nominal",
        "index": "77",
        "is_ignore": "false",
        "is_row_identifier": "false",
        "is_target": "false",
        "name": "d 53001-8",
        "nominal_value": [
          "false",
          "true"
        ],
        "number_of_missing_values": "0"
      },
      {
        "data_type": "nominal",
        "index": "78",
        "is_ignore": "false",
        "is_row_identifier": "false",
        "is_target": "false",
        "name": "d 53001-9",
        "nominal_value": [
          "false",
          "true"
        ],
        "number_of_missing_values": "0"
      },
      {
        "data_type": "nominal",
        "index": "79",
        "is_ignore": "false",
        "is_row_identifier": "false",
        "is_target": "false",
        "name": "d 53010-0",
        "nominal_value": [
          "false",
          "true"
        ],
        "number_of_missing_values": "0"
      },
      {
        "data_type": "nominal",
        "index": "80",
        "is_ignore": "false",
        "is_row_identifier": "false",
        "is_target": "false",
        "name": "d 53010-1",
        "nominal_value": [
          "false",
          "true"
        ],
        "number_of_missing_values": "0"
      },
      {
        "data_type": "nominal",
        "index": "81",
        "is_ignore": "false",
        "is_row_identifier": "false",
        "is_target": "false",
        "name": "d 53010-2",
        "nominal_value": [
          "false",
          "true"
        ],
        "number_of_missing_values": "0"
      },
      {
        "data_type": "nominal",
        "index": "82",
        "is_ignore": "false",
        "is_row_identifier": "false",
        "is_target": "false",
        "name": "d 53010-3",
        "nominal_value": [
          "false",
          "true"
        ],
        "number_of_missing_values": "0"
      },
      {
        "data_type": "nominal",
        "index": "83",
        "is_ignore": "false",
        "is_row_identifier": "false",
        "is_target": "false",
        "name": "d 53010-4",
        "nominal_value": [
          "false",
          "true"
        ],
        "number_of_missing_values": "0"
      },
      {
        "data_type": "nominal",
        "index": "84",
        "is_ignore": "false",
        "is_row_identifier": "false",
        "is_target": "false",
        "name": "d 53010-8",
        "nominal_value": [
          "false",
          "true"
        ],
        "number_of_missing_values": "0"
      },
      {
        "data_type": "nominal",
        "index": "85",
        "is_ignore": "false",
        "is_row_identifier": "false",
        "is_target": "false",
        "name": "d 53010-9",
        "nominal_value": [
          "false",
          "true"
        ],
        "number_of_missing_values": "0"
      },
      {
        "data_type": "nominal",
        "index": "86",
        "is_ignore": "false",
        "is_row_identifier": "false",
        "is_target": "false",
        "name": "d 53011-0",
        "nominal_value": [
          "false",
          "true"
        ],
        "number_of_missing_values": "0"
      },
      {
        "data_type": "nominal",
        "index": "87",
        "is_ignore": "false",
        "is_row_identifier": "false",
        "is_target": "false",
        "name": "d 53011-1",
        "nominal_value": [
          "false",
          "true"
        ],
        "number_of_missing_values": "0"
      },
      {
        "data_type": "nominal",
        "index": "88",
        "is_ignore": "false",
        "is_row_identifier": "false",
        "is_target": "false",
        "name": "d 53011-2",
        "nominal_value": [
          "false",
          "true"
        ],
        "number_of_missing_values": "0"
      },
      {
        "data_type": "nominal",
        "index": "89",
        "is_ignore": "false",
        "is_row_identifier": "false",
        "is_target": "false",
        "name": "d 53011-3",
        "nominal_value": [
          "false",
          "true"
        ],
        "number_of_missing_values": "0"
      },
      {
        "data_type": "nominal",
        "index": "90",
        "is_ignore": "false",
        "is_row_identifier": "false",
        "is_target": "false",
        "name": "d 53011-4",
        "nominal_value": [
          "false",
          "true"
        ],
        "number_of_missing_values": "0"
      },
      {
        "data_type": "nominal",
        "index": "91",
        "is_ignore": "false",
        "is_row_identifier": "false",
        "is_target": "false",
        "name": "d 53011-8",
        "nominal_value": [
          "false",
          "true"
        ],
        "number_of_missing_values": "0"
      },
      {
        "data_type": "nominal",
        "index": "92",
        "is_ignore": "false",
        "is_row_identifier": "false",
        "is_target": "false",
        "name": "d 53011-9",
        "nominal_value": [
          "false",
          "true"
        ],
        "number_of_missing_values": "0"
      },
      {
        "data_type": "nominal",
        "index": "93",
        "is_ignore": "false",
        "is_row_identifier": "false",
        "is_target": "false",
        "name": "d 5302-0",
        "nominal_value": [
          "false",
          "true"
        ],
        "number_of_missing_values": "0"
      },
      {
        "data_type": "nominal",
        "index": "94",
        "is_ignore": "false",
        "is_row_identifier": "false",
        "is_target": "false",
        "name": "d 5302-1",
        "nominal_value": [
          "false",
          "true"
        ],
        "number_of_missing_values": "0"
      },
      {
        "data_type": "nominal",
        "index": "95",
        "is_ignore": "false",
        "is_row_identifier": "false",
        "is_target": "false",
        "name": "d 5302-2",
        "nominal_value": [
          "false",
          "true"
        ],
        "number_of_missing_values": "0"
      },
      {
        "data_type": "nominal",
        "index": "96",
        "is_ignore": "false",
        "is_row_identifier": "false",
        "is_target": "false",
        "name": "d 5302-3",
        "nominal_value": [
          "false",
          "true"
        ],
        "number_of_missing_values": "0"
      },
      {
        "data_type": "nominal",
        "index": "97",
        "is_ignore": "false",
        "is_row_identifier": "false",
        "is_target": "false",
        "name": "d 5302-4",
        "nominal_value": [
          "false",
          "true"
        ],
        "number_of_missing_values": "0"
      },
      {
        "data_type": "nominal",
        "index": "98",
        "is_ignore": "false",
        "is_row_identifier": "false",
        "is_target": "false",
        "name": "d 5302-8",
        "nominal_value": [
          "false",
          "true"
        ],
        "number_of_missing_values": "0"
      },
      {
        "data_type": "nominal",
        "index": "99",
        "is_ignore": "false",
        "is_row_identifier": "false",
        "is_target": "false",
        "name": "d 5302-9",
        "nominal_value": [
          "false",
          "true"
        ],
        "number_of_missing_values": "0"
      },
      {
        "data_type": "nominal",
        "index": "100",
        "is_ignore": "false",
        "is_row_identifier": "false",
        "is_target": "false",
        "name": "d 5400-0",
        "nominal_value": [
          "false",
          "true"
        ],
        "number_of_missing_values": "0"
      },
      {
        "data_type": "nominal",
        "index": "101",
        "is_ignore": "false",
        "is_row_identifier": "false",
        "is_target": "false",
        "name": "d 5400-1",
        "nominal_value": [
          "false",
          "true"
        ],
        "number_of_missing_values": "0"
      },
      {
        "data_type": "nominal",
        "index": "102",
        "is_ignore": "false",
        "is_row_identifier": "false",
        "is_target": "false",
        "name": "d 5400-2",
        "nominal_value": [
          "false",
          "true"
        ],
        "number_of_missing_values": "0"
      },
      {
        "data_type": "nominal",
        "index": "103",
        "is_ignore": "false",
        "is_row_identifier": "false",
        "is_target": "false",
        "name": "d 5400-3",
        "nominal_value": [
          "false",
          "true"
        ],
        "number_of_missing_values": "0"
      },
      {
        "data_type": "nominal",
        "index": "104",
        "is_ignore": "false",
        "is_row_identifier": "false",
        "is_target": "false",
        "name": "d 5400-4",
        "nominal_value": [
          "false",
          "true"
        ],
        "number_of_missing_values": "0"
      },
      {
        "data_type": "nominal",
        "index": "105",
        "is_ignore": "false",
        "is_row_identifier": "false",
        "is_target": "false",
        "name": "d 5400-8",
        "nominal_value": [
          "false",
          "true"
        ],
        "number_of_missing_values": "0"
      },
      {
        "data_type": "nominal",
        "index": "106",
        "is_ignore": "false",
        "is_row_identifier": "false",
        "is_target": "false",
        "name": "d 5400-9",
        "nominal_value": [
          "false",
          "true"
        ],
        "number_of_missing_values": "0"
      },
      {
        "data_type": "nominal",
        "index": "107",
        "is_ignore": "false",
        "is_row_identifier": "false",
        "is_target": "false",
        "name": "d 5401-0",
        "nominal_value": [
          "false",
          "true"
        ],
        "number_of_missing_values": "0"
      },
      {
        "data_type": "nominal",
        "index": "108",
        "is_ignore": "false",
        "is_row_identifier": "false",
        "is_target": "false",
        "name": "d 5401-1",
        "nominal_value": [
          "false",
          "true"
        ],
        "number_of_missing_values": "0"
      },
      {
        "data_type": "nominal",
        "index": "109",
        "is_ignore": "false",
        "is_row_identifier": "false",
        "is_target": "false",
        "name": "d 5401-2",
        "nominal_value": [
          "false",
          "true"
        ],
        "number_of_missing_values": "0"
      },
      {
        "data_type": "nominal",
        "index": "110",
        "is_ignore": "false",
        "is_row_identifier": "false",
        "is_target": "false",
        "name": "d 5401-3",
        "nominal_value": [
          "false",
          "true"
        ],
        "number_of_missing_values": "0"
      },
      {
        "data_type": "nominal",
        "index": "111",
        "is_ignore": "false",
        "is_row_identifier": "false",
        "is_target": "false",
        "name": "d 5401-4",
        "nominal_value": [
          "false",
          "true"
        ],
        "number_of_missing_values": "0"
      },
      {
        "data_type": "nominal",
        "index": "112",
        "is_ignore": "false",
        "is_row_identifier": "false",
        "is_target": "false",
        "name": "d 5401-8",
        "nominal_value": [
          "false",
          "true"
        ],
        "number_of_missing_values": "0"
      },
      {
        "data_type": "nominal",
        "index": "113",
        "is_ignore": "false",
        "is_row_identifier": "false",
        "is_target": "false",
        "name": "d 5401-9",
        "nominal_value": [
          "false",
          "true"
        ],
        "number_of_missing_values": "0"
      },
      {
        "data_type": "nominal",
        "index": "114",
        "is_ignore": "false",
        "is_row_identifier": "false",
        "is_target": "false",
        "name": "d 5402-0",
        "nominal_value": [
          "false",
          "true"
        ],
        "number_of_missing_values": "0"
      },
      {
        "data_type": "nominal",
        "index": "115",
        "is_ignore": "false",
        "is_row_identifier": "false",
        "is_target": "false",
        "name": "d 5402-1",
        "nominal_value": [
          "false",
          "true"
        ],
        "number_of_missing_values": "0"
      },
      {
        "data_type": "nominal",
        "index": "116",
        "is_ignore": "false",
        "is_row_identifier": "false",
        "is_target": "false",
        "name": "d 5402-2",
        "nominal_value": [
          "false",
          "true"
        ],
        "number_of_missing_values": "0"
      },
      {
        "data_type": "nominal",
        "index": "117",
        "is_ignore": "false",
        "is_row_identifier": "false",
        "is_target": "false",
        "name": "d 5402-3",
        "nominal_value": [
          "false",
          "true"
        ],
        "number_of_missing_values": "0"
      },
      {
        "data_type": "nominal",
        "index": "118",
        "is_ignore": "false",
        "is_row_identifier": "false",
        "is_target": "false",
        "name": "d 5402-4",
        "nominal_value": [
          "false",
          "true"
        ],
        "number_of_missing_values": "0"
      },
      {
        "data_type": "nominal",
        "index": "119",
        "is_ignore": "false",
        "is_row_identifier": "false",
        "is_target": "false",
        "name": "d 5402-8",
        "nominal_value": [
          "false",
          "true"
        ],
        "number_of_missing_values": "0"
      },
      {
        "data_type": "nominal",
        "index": "120",
        "is_ignore": "false",
        "is_row_identifier": "false",
        "is_target": "false",
        "name": "d 5402-9",
        "nominal_value": [
          "false",
          "true"
        ],
        "number_of_missing_values": "0"
      },
      {
        "data_type": "nominal",
        "index": "121",
        "is_ignore": "false",
        "is_row_identifier": "false",
        "is_target": "false",
        "name": "d 5403-0",
        "nominal_value": [
          "false",
          "true"
        ],
        "number_of_missing_values": "0"
      },
      {
        "data_type": "nominal",
        "index": "122",
        "is_ignore": "false",
        "is_row_identifier": "false",
        "is_target": "false",
        "name": "d 5403-1",
        "nominal_value": [
          "false",
          "true"
        ],
        "number_of_missing_values": "0"
      },
      {
        "data_type": "nominal",
        "index": "123",
        "is_ignore": "false",
        "is_row_identifier": "false",
        "is_target": "false",
        "name": "d 5403-2",
        "nominal_value": [
          "false",
          "true"
        ],
        "number_of_missing_values": "0"
      },
      {
        "data_type": "nominal",
        "index": "124",
        "is_ignore": "false",
        "is_row_identifier": "false",
        "is_target": "false",
        "name": "d 5403-3",
        "nominal_value": [
          "false",
          "true"
        ],
        "number_of_missing_values": "0"
      },
      {
        "data_type": "nominal",
        "index": "125",
        "is_ignore": "false",
        "is_row_identifier": "false",
        "is_target": "false",
        "name": "d 5403-4",
        "nominal_value": [
          "false",
          "true"
        ],
        "number_of_missing_values": "0"
      },
      {
        "data_type": "nominal",
        "index": "126",
        "is_ignore": "false",
        "is_row_identifier": "false",
        "is_target": "false",
        "name": "d 5403-8",
        "nominal_value": [
          "false",
          "true"
        ],
        "number_of_missing_values": "0"
      },
      {
        "data_type": "nominal",
        "index": "127",
        "is_ignore": "false",
        "is_row_identifier": "false",
        "is_target": "false",
        "name": "d 5403-9",
        "nominal_value": [
          "false",
          "true"
        ],
        "number_of_missing_values": "0"
      },
      {
        "data_type": "nominal",
        "index": "128",
        "is_ignore": "false",
        "is_row_identifier": "false",
        "is_target": "false",
        "name": "d 5404-0",
        "nominal_value": [
          "false",
          "true"
        ],
        "number_of_missing_values": "0"
      },
      {
        "data_type": "nominal",
        "index": "129",
        "is_ignore": "false",
        "is_row_identifier": "false",
        "is_target": "false",
        "name": "d 5404-1",
        "nominal_value": [
          "false",
          "true"
        ],
        "number_of_missing_values": "0"
      },
      {
        "data_type": "nominal",
        "index": "130",
        "is_ignore": "false",
        "is_row_identifier": "false",
        "is_target": "false",
        "name": "d 5404-2",
        "nominal_value": [
          "false",
          "true"
        ],
        "number_of_missing_values": "0"
      },
      {
        "data_type": "nominal",
        "index": "131",
        "is_ignore": "false",
        "is_row_identifier": "false",
        "is_target": "false",
        "name": "d 5404-3",
        "nominal_value": [
          "false",
          "true"
        ],
        "number_of_missing_values": "0"
      },
      {
        "data_type": "nominal",
        "index": "132",
        "is_ignore": "false",
        "is_row_identifier": "false",
        "is_target": "false",
        "name": "d 5404-4",
        "nominal_value": [
          "false",
          "true"
        ],
        "number_of_missing_values": "0"
      },
      {
        "data_type": "nominal",
        "index": "133",
        "is_ignore": "false",
        "is_row_identifier": "false",
        "is_target": "false",
        "name": "d 5404-8",
        "nominal_value": [
          "false",
          "true"
        ],
        "number_of_missing_values": "0"
      },
      {
        "data_type": "nominal",
        "index": "134",
        "is_ignore": "false",
        "is_row_identifier": "false",
        "is_target": "false",
        "name": "d 5404-9",
        "nominal_value": [
          "false",
          "true"
        ],
        "number_of_missing_values": "0"
      },
      {
        "data_type": "nominal",
        "index": "135",
        "is_ignore": "false",
        "is_row_identifier": "false",
        "is_target": "false",
        "name": "d 5500-0",
        "nominal_value": [
          "false",
          "true"
        ],
        "number_of_missing_values": "0"
      },
      {
        "data_type": "nominal",
        "index": "136",
        "is_ignore": "false",
        "is_row_identifier": "false",
        "is_target": "false",
        "name": "d 5500-1",
        "nominal_value": [
          "false",
          "true"
        ],
        "number_of_missing_values": "0"
      },
      {
        "data_type": "nominal",
        "index": "137",
        "is_ignore": "false",
        "is_row_identifier": "false",
        "is_target": "false",
        "name": "d 5500-2",
        "nominal_value": [
          "false",
          "true"
        ],
        "number_of_missing_values": "0"
      },
      {
        "data_type": "nominal",
        "index": "138",
        "is_ignore": "false",
        "is_row_identifier": "false",
        "is_target": "false",
        "name": "d 5500-3",
        "nominal_value": [
          "false",
          "true"
        ],
        "number_of_missing_values": "0"
      },
      {
        "data_type": "nominal",
        "index": "139",
        "is_ignore": "false",
        "is_row_identifier": "false",
        "is_target": "false",
        "name": "d 5500-4",
        "nominal_value": [
          "false",
          "true"
        ],
        "number_of_missing_values": "0"
      },
      {
        "data_type": "nominal",
        "index": "140",
        "is_ignore": "false",
        "is_row_identifier": "false",
        "is_target": "false",
        "name": "d 5500-8",
        "nominal_value": [
          "false",
          "true"
        ],
        "number_of_missing_values": "0"
      },
      {
        "data_type": "nominal",
        "index": "141",
        "is_ignore": "false",
        "is_row_identifier": "false",
        "is_target": "false",
        "name": "d 5500-9",
        "nominal_value": [
          "false",
          "true"
        ],
        "number_of_missing_values": "0"
      },
      {
        "data_type": "nominal",
        "index": "142",
        "is_ignore": "false",
        "is_row_identifier": "false",
        "is_target": "false",
        "name": "d 5501-0",
        "nominal_value": [
          "false",
          "true"
        ],
        "number_of_missing_values": "0"
      },
      {
        "data_type": "nominal",
        "index": "143",
        "is_ignore": "false",
        "is_row_identifier": "false",
        "is_target": "false",
        "name": "d 5501-1",
        "nominal_value": [
          "false",
          "true"
        ],
        "number_of_missing_values": "0"
      },
      {
        "data_type": "nominal",
        "index": "144",
        "is_ignore": "false",
        "is_row_identifier": "false",
        "is_target": "false",
        "name": "d 5501-2",
        "nominal_value": [
          "false",
          "true"
        ],
        "number_of_missing_values": "0"
      },
      {
        "data_type": "nominal",
        "index": "145",
        "is_ignore": "false",
        "is_row_identifier": "false",
        "is_target": "false",
        "name": "d 5501-3",
        "nominal_value": [
          "false",
          "true"
        ],
        "number_of_missing_values": "0"
      },
      {
        "data_type": "nominal",
        "index": "146",
        "is_ignore": "false",
        "is_row_identifier": "false",
        "is_target": "false",
        "name": "d 5501-4",
        "nominal_value": [
          "false",
          "true"
        ],
        "number_of_missing_values": "0"
      },
      {
        "data_type": "nominal",
        "index": "147",
        "is_ignore": "false",
        "is_row_identifier": "false",
        "is_target": "false",
        "name": "d 5501-8",
        "nominal_value": [
          "false",
          "true"
        ],
        "number_of_missing_values": "0"
      },
      {
        "data_type": "nominal",
        "index": "148",
        "is_ignore": "false",
        "is_row_identifier": "false",
        "is_target": "false",
        "name": "d 5501-9",
        "nominal_value": [
          "false",
          "true"
        ],
        "number_of_missing_values": "0"
      },
      {
        "data_type": "nominal",
        "index": "149",
        "is_ignore": "false",
        "is_row_identifier": "false",
        "is_target": "false",
        "name": "d 5600-0",
        "nominal_value": [
          "false",
          "true"
        ],
        "number_of_missing_values": "0"
      },
      {
        "data_type": "nominal",
        "index": "150",
        "is_ignore": "false",
        "is_row_identifier": "false",
        "is_target": "false",
        "name": "d 5600-1",
        "nominal_value": [
          "false",
          "true"
        ],
        "number_of_missing_values": "0"
      },
      {
        "data_type": "nominal",
        "index": "151",
        "is_ignore": "false",
        "is_row_identifier": "false",
        "is_target": "false",
        "name": "d 5600-2",
        "nominal_value": [
          "false",
          "true"
        ],
        "number_of_missing_values": "0"
      },
      {
        "data_type": "nominal",
        "index": "152",
        "is_ignore": "false",
        "is_row_identifier": "false",
        "is_target": "false",
        "name": "d 5600-3",
        "nominal_value": [
          "false",
          "true"
        ],
        "number_of_missing_values": "0"
      },
      {
        "data_type": "nominal",
        "index": "153",
        "is_ignore": "false",
        "is_row_identifier": "false",
        "is_target": "false",
        "name": "d 5600-4",
        "nominal_value": [
          "false",
          "true"
        ],
        "number_of_missing_values": "0"
      },
      {
        "data_type": "nominal",
        "index": "154",
        "is_ignore": "false",
        "is_row_identifier": "false",
        "is_target": "false",
        "name": "d 5600-8",
        "nominal_value": [
          "false",
          "true"
        ],
        "number_of_missing_values": "0"
      },
      {
        "data_type": "nominal",
        "index": "155",
        "is_ignore": "false",
        "is_row_identifier": "false",
        "is_target": "false",
        "name": "d 5600-9",
        "nominal_value": [
          "false",
          "true"
        ],
        "number_of_missing_values": "0"
      },
      {
        "data_type": "nominal",
        "index": "156",
        "is_ignore": "false",
        "is_row_identifier": "false",
        "is_target": "false",
        "name": "d 5602-0",
        "nominal_value": [
          "false",
          "true"
        ],
        "number_of_missing_values": "0"
      },
      {
        "data_type": "nominal",
        "index": "157",
        "is_ignore": "false",
        "is_row_identifier": "false",
        "is_target": "false",
        "name": "d 5602-1",
        "nominal_value": [
          "false",
          "true"
        ],
        "number_of_missing_values": "0"
      },
      {
        "data_type": "nominal",
        "index": "158",
        "is_ignore": "false",
        "is_row_identifier": "false",
        "is_target": "false",
        "name": "d 5602-2",
        "nominal_value": [
          "false",
          "true"
        ],
        "number_of_missing_values": "0"
      },
      {
        "data_type": "nominal",
        "index": "159",
        "is_ignore": "false",
        "is_row_identifier": "false",
        "is_target": "false",
        "name": "d 5602-3",
        "nominal_value": [
          "false",
          "true"
        ],
        "number_of_missing_values": "0"
      },
      {
        "data_type": "nominal",
        "index": "160",
        "is_ignore": "false",
        "is_row_identifier": "false",
        "is_target": "false",
        "name": "d 5602-4",
        "nominal_value": [
          "false",
          "true"
        ],
        "number_of_missing_values": "0"
      },
      {
        "data_type": "nominal",
        "index": "161",
        "is_ignore": "false",
        "is_row_identifier": "false",
        "is_target": "false",
        "name": "d 5602-8",
        "nominal_value": [
          "false",
          "true"
        ],
        "number_of_missing_values": "0"
      },
      {
        "data_type": "nominal",
        "index": "162",
        "is_ignore": "false",
        "is_row_identifier": "false",
        "is_target": "false",
        "name": "d 5602-9",
        "nominal_value": [
          "false",
          "true"
        ],
        "number_of_missing_values": "0"
      },
      {
        "data_type": "nominal",
        "index": "163",
        "is_ignore": "false",
        "is_row_identifier": "false",
        "is_target": "false",
        "name": "d 5700-0",
        "nominal_value": [
          "false",
          "true"
        ],
        "number_of_missing_values": "0"
      },
      {
        "data_type": "nominal",
        "index": "164",
        "is_ignore": "false",
        "is_row_identifier": "false",
        "is_target": "false",
        "name": "d 5700-1",
        "nominal_value": [
          "false",
          "true"
        ],
        "number_of_missing_values": "0"
      },
      {
        "data_type": "nominal",
        "index": "165",
        "is_ignore": "false",
        "is_row_identifier": "false",
        "is_target": "false",
        "name": "d 5700-2",
        "nominal_value": [
          "false",
          "true"
        ],
        "number_of_missing_values": "0"
      },
      {
        "data_type": "nominal",
        "index": "166",
        "is_ignore": "false",
        "is_row_identifier": "false",
        "is_target": "false",
        "name": "d 5700-3",
        "nominal_value": [
          "false",
          "true"
        ],
        "number_of_missing_values": "0"
      },
      {
        "data_type": "nominal",
        "index": "167",
        "is_ignore": "false",
        "is_row_identifier": "false",
        "is_target": "false",
        "name": "d 5700-4",
        "nominal_value": [
          "false",
          "true"
        ],
        "number_of_missing_values": "0"
      },
      {
        "data_type": "nominal",
        "index": "168",
        "is_ignore": "false",
        "is_row_identifier": "false",
        "is_target": "false",
        "name": "d 5700-8",
        "nominal_value": [
          "false",
          "true"
        ],
        "number_of_missing_values": "0"
      },
      {
        "data_type": "nominal",
        "index": "169",
        "is_ignore": "false",
        "is_row_identifier": "false",
        "is_target": "false",
        "name": "d 5700-9",
        "nominal_value": [
          "false",
          "true"
        ],
        "number_of_missing_values": "0"
      },
      {
        "data_type": "nominal",
        "index": "170",
        "is_ignore": "false",
        "is_row_identifier": "false",
        "is_target": "false",
        "name": "d 5701-0",
        "nominal_value": [
          "false",
          "true"
        ],
        "number_of_missing_values": "0"
      },
      {
        "data_type": "nominal",
        "index": "171",
        "is_ignore": "false",
        "is_row_identifier": "false",
        "is_target": "false",
        "name": "d 5701-1",
        "nominal_value": [
          "false",
          "true"
        ],
        "number_of_missing_values": "0"
      },
      {
        "data_type": "nominal",
        "index": "172",
        "is_ignore": "false",
        "is_row_identifier": "false",
        "is_target": "false",
        "name": "d 5701-2",
        "nominal_value": [
          "false",
          "true"
        ],
        "number_of_missing_values": "0"
      },
      {
        "data_type": "nominal",
        "index": "173",
        "is_ignore": "false",
        "is_row_identifier": "false",
        "is_target": "false",
        "name": "d 5701-3",
        "nominal_value": [
          "false",
          "true"
        ],
        "number_of_missing_values": "0"
      },
      {
        "data_type": "nominal",
        "index": "174",
        "is_ignore": "false",
        "is_row_identifier": "false",
        "is_target": "false",
        "name": "d 5701-4",
        "nominal_value": [
          "false",
          "true"
        ],
        "number_of_missing_values": "0"
      },
      {
        "data_type": "nominal",
        "index": "175",
        "is_ignore": "false",
        "is_row_identifier": "false",
        "is_target": "false",
        "name": "d 5701-8",
        "nominal_value": [
          "false",
          "true"
        ],
        "number_of_missing_values": "0"
      },
      {
        "data_type": "nominal",
        "index": "176",
        "is_ignore": "false",
        "is_row_identifier": "false",
        "is_target": "false",
        "name": "d 5701-9",
        "nominal_value": [
          "false",
          "true"
        ],
        "number_of_missing_values": "0"
      },
      {
        "data_type": "nominal",
        "index": "177",
        "is_ignore": "false",
        "is_row_identifier": "false",
        "is_target": "false",
        "name": "d 57020-0",
        "nominal_value": [
          "false",
          "true"
        ],
        "number_of_missing_values": "0"
      },
      {
        "data_type": "nominal",
        "index": "178",
        "is_ignore": "false",
        "is_row_identifier": "false",
        "is_target": "false",
        "name": "d 57020-1",
        "nominal_value": [
          "false",
          "true"
        ],
        "number_of_missing_values": "0"
      },
      {
        "data_type": "nominal",
        "index": "179",
        "is_ignore": "false",
        "is_row_identifier": "false",
        "is_target": "false",
        "name": "d 57020-2",
        "nominal_value": [
          "false",
          "true"
        ],
        "number_of_missing_values": "0"
      },
      {
        "data_type": "nominal",
        "index": "180",
        "is_ignore": "false",
        "is_row_identifier": "false",
        "is_target": "false",
        "name": "d 57020-3",
        "nominal_value": [
          "false",
          "true"
        ],
        "number_of_missing_values": "0"
      },
      {
        "data_type": "nominal",
        "index": "181",
        "is_ignore": "false",
        "is_row_identifier": "false",
        "is_target": "false",
        "name": "d 57020-4",
        "nominal_value": [
          "false",
          "true"
        ],
        "number_of_missing_values": "0"
      },
      {
        "data_type": "nominal",
        "index": "182",
        "is_ignore": "false",
        "is_row_identifier": "false",
        "is_target": "false",
        "name": "d 57020-8",
        "nominal_value": [
          "false",
          "true"
        ],
        "number_of_missing_values": "0"
      },
      {
        "data_type": "nominal",
        "index": "183",
        "is_ignore": "false",
        "is_row_identifier": "false",
        "is_target": "false",
        "name": "d 57020-9",
        "nominal_value": [
          "false",
          "true"
        ],
        "number_of_missing_values": "0"
      },
      {
        "data_type": "nominal",
        "index": "184",
        "is_ignore": "false",
        "is_row_identifier": "false",
        "is_target": "false",
        "name": "d 57021-0",
        "nominal_value": [
          "false",
          "true"
        ],
        "number_of_missing_values": "0"
      },
      {
        "data_type": "nominal",
        "index": "185",
        "is_ignore": "false",
        "is_row_identifier": "false",
        "is_target": "false",
        "name": "d 57021-1",
        "nominal_value": [
          "false",
          "true"
        ],
        "number_of_missing_values": "0"
      },
      {
        "data_type": "nominal",
        "index": "186",
        "is_ignore": "false",
        "is_row_identifier": "false",
        "is_target": "false",
        "name": "d 57021-2",
        "nominal_value": [
          "false",
          "true"
        ],
        "number_of_missing_values": "0"
      },
      {
        "data_type": "nominal",
        "index": "187",
        "is_ignore": "false",
        "is_row_identifier": "false",
        "is_target": "false",
        "name": "d 57021-3",
        "nominal_value": [
          "false",
          "true"
        ],
        "number_of_missing_values": "0"
      },
      {
        "data_type": "nominal",
        "index": "188",
        "is_ignore": "false",
        "is_row_identifier": "false",
        "is_target": "false",
        "name": "d 57021-4",
        "nominal_value": [
          "false",
          "true"
        ],
        "number_of_missing_values": "0"
      },
      {
        "data_type": "nominal",
        "index": "189",
        "is_ignore": "false",
        "is_row_identifier": "false",
        "is_target": "false",
        "name": "d 57021-5",
        "nominal_value": [
          "false",
          "true"
        ],
        "number_of_missing_values": "0"
      },
      {
        "data_type": "nominal",
        "index": "190",
        "is_ignore": "false",
        "is_row_identifier": "false",
        "is_target": "false",
        "name": "d 57021-6",
        "nominal_value": [
          "false",
          "true"
        ],
        "number_of_missing_values": "0"
      },
      {
        "data_type": "nominal",
        "index": "191",
        "is_ignore": "false",
        "is_row_identifier": "false",
        "is_target": "false",
        "name": "d 57022-0",
        "nominal_value": [
          "false",
          "true"
        ],
        "number_of_missing_values": "0"
      },
      {
        "data_type": "nominal",
        "index": "192",
        "is_ignore": "false",
        "is_row_identifier": "false",
        "is_target": "false",
        "name": "d 57022-1",
        "nominal_value": [
          "false",
          "true"
        ],
        "number_of_missing_values": "0"
      },
      {
        "data_type": "nominal",
        "index": "193",
        "is_ignore": "false",
        "is_row_identifier": "false",
        "is_target": "false",
        "name": "d 57022-2",
        "nominal_value": [
          "false",
          "true"
        ],
        "number_of_missing_values": "0"
      },
      {
        "data_type": "nominal",
        "index": "194",
        "is_ignore": "false",
        "is_row_identifier": "false",
        "is_target": "false",
        "name": "d 57022-3",
        "nominal_value": [
          "false",
          "true"
        ],
        "number_of_missing_values": "0"
      },
      {
        "data_type": "nominal",
        "index": "195",
        "is_ignore": "false",
        "is_row_identifier": "false",
        "is_target": "false",
        "name": "d 57022-4",
        "nominal_value": [
          "false",
          "true"
        ],
        "number_of_missing_values": "0"
      },
      {
        "data_type": "nominal",
        "index": "196",
        "is_ignore": "false",
        "is_row_identifier": "false",
        "is_target": "false",
        "name": "d 57022-8",
        "nominal_value": [
          "false",
          "true"
        ],
        "number_of_missing_values": "0"
      },
      {
        "data_type": "nominal",
        "index": "197",
        "is_ignore": "false",
        "is_row_identifier": "false",
        "is_target": "false",
        "name": "d 57022-9",
        "nominal_value": [
          "false",
          "true"
        ],
        "number_of_missing_values": "0"
      },
      {
        "data_type": "nominal",
        "index": "198",
        "is_ignore": "false",
        "is_row_identifier": "false",
        "is_target": "false",
        "name": "d 571-0",
        "nominal_value": [
          "false",
          "true"
        ],
        "number_of_missing_values": "0"
      },
      {
        "data_type": "nominal",
        "index": "199",
        "is_ignore": "false",
        "is_row_identifier": "false",
        "is_target": "false",
        "name": "d 571-1",
        "nominal_value": [
          "false",
          "true"
        ],
        "number_of_missing_values": "0"
      },
      {
        "data_type": "nominal",
        "index": "200",
        "is_ignore": "false",
        "is_row_identifier": "false",
        "is_target": "false",
        "name": "d 571-2",
        "nominal_value": [
          "false",
          "true"
        ],
        "number_of_missing_values": "0"
      },
      {
        "data_type": "nominal",
        "index": "201",
        "is_ignore": "false",
        "is_row_identifier": "false",
        "is_target": "false",
        "name": "d 571-3",
        "nominal_value": [
          "false",
          "true"
        ],
        "number_of_missing_values": "0"
      },
      {
        "data_type": "nominal",
        "index": "202",
        "is_ignore": "false",
        "is_row_identifier": "false",
        "is_target": "false",
        "name": "d 571-4",
        "nominal_value": [
          "false",
          "true"
        ],
        "number_of_missing_values": "0"
      },
      {
        "data_type": "nominal",
        "index": "203",
        "is_ignore": "false",
        "is_row_identifier": "false",
        "is_target": "false",
        "name": "d 571-8",
        "nominal_value": [
          "false",
          "true"
        ],
        "number_of_missing_values": "0"
      },
      {
        "data_type": "nominal",
        "index": "204",
        "is_ignore": "false",
        "is_row_identifier": "false",
        "is_target": "false",
        "name": "d 571-9",
        "nominal_value": [
          "false",
          "true"
        ],
        "number_of_missing_values": "0"
      },
      {
        "data_type": "nominal",
        "index": "205",
        "is_ignore": "false",
        "is_row_identifier": "false",
        "is_target": "false",
        "name": "Classes",
        "nominal_value": [
          "class1",
          "class2",
          "class3",
          "class4",
          "class5",
          "class6",
          "class7"
        ],
        "number_of_missing_values": "0"
      }
    ]
  }
}