{
  "data_set_description": {
    "description": "Laboratorio_dataset_car",
    "description_version": "1",
    "file_id": "22045465",
    "format": "ARFF",
    "id": "42875",
    "licence": "CC0",
    "md5_checksum": "72aacf6af867a922c229eb318e511095",
    "minio_url": "https://data.openml.org/datasets/0004/42875/dataset_42875.pq",
    "name": "Laboratorio_dataset_car",
    "parquet_url": "https://data.openml.org/datasets/0004/42875/dataset_42875.pq",
    "processing_date": "2021-09-16 23:01:12",
    "status": "active",
    "upload_date": "2021-04-30T10:44:42",
    "url": "https://api.openml.org/data/v1/download/22045465/Laboratorio_dataset_car.arff",
    "version": "2",
    "visibility": "public"
  }
}