{
  "data_features": {
    "feature": [
      {
        "data_type": "numeric",
        "index": "0",
        "is_ignore": "false",
        "is_row_identifier": "false",
        "is_target": "false",
        "name": "A1",
        "number_of_missing_values": "0"
      },
      {
        "data_type": "numeric",
        "index": "1",
        "is_ignore": "false",
        "is_row_identifier": "false",
        "is_target": "false",
        "name": "A2",
        "number_of_missing_values": "0"
      },
      {
        "data_type": "numeric",
        "index": "2",
        "is_ignore": "false",
        "is_row_identifier": "false",
        "is_target": "false",
        "name": "A3",
        "number_of_missing_values": "0"
      },
      {
        "data_type": "numeric",
        "index": "3",
        "is_ignore": "false",
        "is_row_identifier": "false",
        "is_target": "false",
        "name": "A4",
        "number_of_missing_values": "0"
      },
      {
        "data_type": "numeric",
        "index": "4",
        "is_ignore": "false",
        "is_row_identifier": "false",
        "is_target": "false",
        "name": "A5",
        "number_of_missing_values": "0"
      },
      {
        "data_type": "numeric",
        "index": "5",
        "is_ignore": "false",
        "is_row_identifier": "false",
        "is_target": "false",
        "name": "A6",
        "number_of_missing_values": "0"
      },
      {
        "data_type": "numeric",
        "index": "6",
        "is_ignore": "false",
        "is_row_identifier": "false",
        "is_target": "false",
        "name": "A7",
        "number_of_missing_values": "0"
      },
      {
        "data_type": "numeric",
        "index": "7",
        "is_ignore": "false",
        "is_row_identifier": "false",
        "is_target": "false",
        "name": "A8",
        "number_of_missing_values": "0"
      },
      {
        "data_type": "numeric",
        "index": "8",
        "is_ignore": "false",
        "is_row_identifier": "false",
        "is_target": "false",
        "name": "A9",
        "number_of_missing_values": "0"
      },
      {
        "data_type": "numeric",
        "index": "9",
        "is_ignore": "false",
        "is_row_identifier": "false",
        "is_target": "false",
        "name": "A10",
        "number_of_missing_values": "0"
      },
      {
        "data_type": "numeric",
        "index": "10",
        "is_ignore": "false",
        "is_row_identifier": "false",
        "is_target": "false",
        "name": "A11",
        "number_of_missing_values": "0"
      },
      {
        "data_type": "numeric",
        "index": "11",
        "is_ignore": "false",
        "is_row_identifier": "false",
        "is_target": "false",
        "name": "A12",
        "number_of_missing_values": "0"
      },
      {
        "data_type": "numeric",
        "index": "12",
        "is_ignore": "false",
        "is_row_identifier": "false",
        "is_target": "false",
        "name": "A13",
        "number_of_missing_values": "0"
      },
      {
        "data_type": "numeric",
        "index": "13",
        "is_ignore": "false",
        "is_row_identifier": "false",
        "is_target": "false",
        "name": "A14",
        "number_of_missing_values": "0"
      },
      {
        "data_type": "numeric",
        "index": "14",
        "is_ignore": "false",
        "is_row_identifier": "false",
        "is_target": "false",
        "name": "A15",
        "number_of_missing_values": "0"
      },
      {
        "data_type": "numeric",
        "index": "15",
        "is_ignore": "false",
        "is_row_identifier": "false",
        "is_target": "false",
        "name": "A16",
        "number_of_missing_values": "0"
      },
      {
        "data_type": "numeric",
        "index": "16",
        "is_ignore": "false",
        "is_row_identifier": "false",
        "is_target": "false",
        "name": "A17",
        "number_of_missing_values": "0"
      },
      {
        "data_type": "numeric",
        "index": "17",
        "is_ignore": "false",
        "is_row_identifier": "false",
        "is_target": "false",
        "name": "A18",
        "number_of_missing_values": "0"
      },
      {
        "data_type": "numeric",
        "index": "18",
        "is_ignore": "false",
        "is_row_identifier": "false",
        "is_target": "false",
        "name": "A19",
        "number_of_missing_values": "0"
      },
      {
        "data_type": "numeric",
        "index": "19",
        "is_ignore": "false",
        "is_row_identifier": "false",
        "is_target": "false",
        "name": "A20",
        "number_of_missing_values": "0"
      },
      {
        "data_type": "numeric",
        "index": "20",
        "is_ignore": "false",
        "is_row_identifier": "false",
        "is_target": "false",
        "name": "A21",
        "number_of_missing_values": "0"
      },
      {
        "data_type": "numeric",
        "index": "21",
        "is_ignore": "false",
        "is_row_identifier": "false",
        "is_target": "false",
        "name": "A22",
        "number_of_missing_values": "0"
      },
      {
        "data_type": "numeric",
        "index": "22",
        "is_ignore": "false",
        "is_row_identifier": "false",
        "is_target": "false",
        "name": "A23",
        "number_of_missing_values": "0"
      },
      {
        "data_type": "numeric",
        "index": "23",
        "is_ignore": "false",
        "is_row_identifier": "false",
        "is_target": "false",
        "name": "A24",
        "number_of_missing_values": "0"
      },
      {
        "data_type": "nominal",
        "index": "24",
        "is_ignore": "false",
        "is_row_identifier": "false",
        "is_target": "true",
        "name": "L1",
        "nominal_value": [
          "1",
          "10",
          "11",
          "2",
          "3",
          "4",
          "5",
          "6",
          "7",
          "8",
          "9"
        ],
        "number_of_missing_values": "0"
      },
      {
        "data_type": "nominal",
        "index": "25",
        "is_ignore": "false",
        "is_row_identifier": "false",
        "is_target": "true",
        "name": "L2",
        "nominal_value": [
          "1",
          "10",
          "11",
          "2",
          "3",
          "4",
          "5",
          "6",
          "7",
          "8",
          "9"
        ],
        "number_of_missing_values": "0"
      },
      {
        "data_type": "nominal",
        "index": "26",
        "is_ignore": "false",
        "is_row_identifier": "false",
        "is_target": "true",
        "name": "L3",
        "nominal_value": [
          "1",
          "10",
          "11",
          "2",
          "3",
          "4",
          "5",
          "6",
          "7",
          "8",
          "9"
        ],
        "number_of_missing_values": "0"
      },
      {
        "data_type": "nominal",
        "index": "27",
        "is_ignore": "false",
        "is_row_identifier": "false",
        "is_target": "true",
        "name": "L4",
        "nominal_value": [
          "1",
          "10",
          "11",
          "2",
          "3",
          "4",
          "5",
          "6",
          "7",
          "8",
          "9"
        ],
        "number_of_missing_values": "0"
      },
      {
        "data_type": "nominal",
        "index": "28",
        "is_ignore": "false",
        "is_row_identifier": "false",
        "is_target": "true",
        "name": "L5",
        "nominal_value": [
          "1",
          "10",
          "11",
          "2",
          "3",
          "4",
          "5",
          "6",
          "7",
          "8",
          "9"
        ],
        "number_of_missing_values": "0"
      },
      {
        "data_type": "nominal",
        "index": "29",
        "is_ignore": "false",
        "is_row_identifier": "false",
        "is_target": "true",
        "name": "L6",
        "nominal_value": [
          "1",
          "10",
          "11",
          "2",
          "3",
          "4",
          "5",
          "6",
          "7",
          "8",
          "9"
        ],
        "number_of_missing_values": "0"
      },
      {
        "data_type": "nominal",
        "index": "30",
        "is_ignore": "false",
        "is_row_identifier": "false",
        "is_target": "true",
        "name": "L7",
        "nominal_value": [
          "1",
          "10",
          "11",
          "2",
          "3",
          "4",
          "5",
          "6",
          "7",
          "8",
          "9"
        ],
        "number_of_missing_values": "0"
      },
      {
        "data_type": "nominal",
        "index": "31",
        "is_ignore": "false",
        "is_row_identifier": "false",
        "is_target": "true",
        "name": "L8",
        "nominal_value": [
          "1",
          "10",
          "11",
          "2",
          "3",
          "4",
          "5",
          "6",
          "7",
          "8",
          "9"
        ],
        "number_of_missing_values": "0"
      },
      {
        "data_type": "nominal",
        "index": "32",
        "is_ignore": "false",
        "is_row_identifier": "false",
        "is_target": "true",
        "name": "L9",
        "nominal_value": [
          "1",
          "10",
          "11",
          "2",
          "3",
          "4",
          "5",
          "6",
          "7",
          "8",
          "9"
        ],
        "number_of_missing_values": "0"
      },
      {
        "data_type": "nominal",
        "index": "33",
        "is_ignore": "false",
        "is_row_identifier": "false",
        "is_target": "true",
        "name": "L10",
        "nominal_value": [
          "1",
          "10",
          "11",
          "2",
          "3",
          "4",
          "5",
          "6",
          "7",
          "8",
          "9"
        ],
        "number_of_missing_values": "0"
      },
      {
        "data_type": "nominal",
        "index": "34",
        "is_ignore": "false",
        "is_row_identifier": "false",
        "is_target": "true",
        "name": "L11",
        "nominal_value": [
          "1",
          "10",
          "11",
          "2",
          "3",
          "4",
          "5",
          "6",
          "7",
          "8",
          "9"
        ],
        "number_of_missing_values": "0"
      }
    ]
  }
}