{
  "data_qualities": {
    "quality": [
      {
        "name": "AutoCorrelation",
        "value": "0.027354382144801306"
      },
      {
        "name": "Dimensionality",
        "value": "6.688392978636549"
      },
      {
        "name": "MajorityClassPercentage",
        "value": "2.7214587018641994"
      },
      {
        "name": "MajorityClassSize",
        "value": "200.0"
      },
      {
        "name": "MinorityClassPercentage",
        "value": "2.5037420057150634"
      },
      {
        "name": "MinorityClassSize",
        "value": "184.0"
      },
      {
        "name": "NumberOfBinaryFeatures",
        "value": "0.0"
      },
      {
        "name": "NumberOfClasses",
        "value": "37.0"
      },
      {
        "name": "NumberOfFeatures",
        "value": "49153.0"
      },
      {
        "name": "NumberOfInstances",
        "value": "7349.0"
      },
      {
        "name": "NumberOfInstancesWithMissingValues",
        "value": "0.0"
      },
      {
        "name": "NumberOfMissingValues",
        "value": "0.0"
      },
      {
        "name": "NumberOfNumericFeatures",
        "value": "49152.0"
      },
      {
        "name": "NumberOfSymbolicFeatures",
        "value": "1.0"
      },
      {
        "name": "PercentageOfBinaryFeatures",
        "value": "0.0"
      },
      {
        "name": "PercentageOfInstancesWithMissingValues",
        "value": "0.0"
      },
      {
        "name": "PercentageOfMissingValues",
        "value": "0.0"
      },
      {
        "name": "PercentageOfNumericFeatures",
        "value": "99.99796553618295"
      },
      {
        "name": "PercentageOfSymbolicFeatures",
        "value": "0.0020344638170610133"
      }
    ]
  }
}