{
  "data_qualities": {
    "quality": [
      {
        "name": "AutoCorrelation",
        "value": []
      },
      {
        "name": "Dimensionality",
        "value": "5.098572399728076E-4"
      },
      {
        "name": "MajorityClassPercentage",
        "value": []
      },
      {
        "name": "MajorityClassSize",
        "value": []
      },
      {
        "name": "MinorityClassPercentage",
        "value": []
      },
      {
        "name": "MinorityClassSize",
        "value": []
      },
      {
        "name": "NumberOfBinaryFeatures",
        "value": "2.0"
      },
      {
        "name": "NumberOfClasses",
        "value": []
      },
      {
        "name": "NumberOfFeatures",
        "value": "21.0"
      },
      {
        "name": "NumberOfInstances",
        "value": "41188.0"
      },
      {
        "name": "NumberOfInstancesWithMissingValues",
        "value": "0.0"
      },
      {
        "name": "NumberOfMissingValues",
        "value": "0.0"
      },
      {
        "name": "NumberOfNumericFeatures",
        "value": "10.0"
      },
      {
        "name": "NumberOfSymbolicFeatures",
        "value": "11.0"
      },
      {
        "name": "PercentageOfBinaryFeatures",
        "value": "9.523809523809524"
      },
      {
        "name": "PercentageOfInstancesWithMissingValues",
        "value": "0.0"
      },
      {
        "name": "PercentageOfMissingValues",
        "value": "0.0"
      },
      {
        "name": "PercentageOfNumericFeatures",
        "value": "47.61904761904761"
      },
      {
        "name": "PercentageOfSymbolicFeatures",
        "value": "52.38095238095239"
      }
    ]
  }
}