{
  "data_set_description": {
    "collection_date": "2014-04-30",
    "creator": "FiveThirtyEight",
    "default_target_attribute": "Census_Region",
    "description": "Survey to know if people self-identify as Midwesterners.",
    "description_version": "1",
    "file_id": "22045032",
    "format": "arff",
    "id": "42805",
    "language": "English",
    "licence": "Creative Commons Attribution 4.0 International License",
    "md5_checksum": "ebb30d116bbb2950bb696ae11f4215ae",
    "minio_url": "https://data.openml.org/datasets/0004/42805/dataset_42805.pq",
    "name": "Midwest_survey",
    "original_data_url": "https://raw.githubusercontent.com/fivethirtyeight/data/master/region-survey/MIDWEST.csv",
    "paper_url": "https://raw.githubusercontent.com/fivethirtyeight/data/master/region-survey",
    "parquet_url": "https://data.openml.org/datasets/0004/42805/dataset_42805.pq",
    "processing_date": "2021-02-17 11:15:02",
    "row_id_attribute": "RespondentID",
    "status": "active",
    "upload_date": "2021-02-17T11:14:33",
    "url": "https://api.openml.org/data/v1/download/22045032/Midwest_survey.arff",
    "version": "17",
    "version_label": "0.1",
    "visibility": "public"
  }
}