{
  "data_set_description": {
    "contributor": "Eduardo J. Spinosa",
    "creator": "Christian Gruhl",
    "default_target_attribute": "label",
    "description": "Outliers data set extracted from the Illustration (Fig. 3) in &quot;Novelty detection with application to data\nstreams&quot;",
    "description_version": "1",
    "file_id": "22044962",
    "format": "ARFF",
    "id": "42793",
    "licence": "CC0",
    "md5_checksum": "02855ee79525e0bc70d3a1b85448010a",
    "minio_url": "https://data.openml.org/datasets/0004/42793/dataset_42793.pq",
    "name": "olindda_outliers",
    "paper_url": "https://www.researchgate.net/profile/Andre_De_Carvalho/publication/220571728_Novelty_detection_with_application_to_data_streams/links/00b4953676e82e1bc3000000/Novelty-detection-with-application-to-data-streams.pdf",
    "parquet_url": "https://data.openml.org/datasets/0004/42793/dataset_42793.pq",
    "processing_date": "2021-01-21 13:29:02",
    "status": "active",
    "upload_date": "2021-01-21T13:28:13",
    "url": "https://api.openml.org/data/v1/download/22044962/olindda_outliers.arff",
    "version": "1",
    "version_label": "1",
    "visibility": "public"
  }
}