{
  "data_set_description": {
    "citation": "Cerda, P., & Varoquaux, G. (2020). Encoding high-cardinality string categorical variables. IEEE Transactions on Knowledge and Data Engineering.",
    "collection_date": "2015",
    "creator": "P. Cerda and G. Varoquaux",
    "default_target_attribute": "Sex_of_Driver",
    "description": "Data reported to the police about the circumstances of personal injury road accidents in Great Britain from 1979, and the maker and model information of vehicles involved in the respective accident.\n\nThis version includes data up to 2015.",
    "file_id": "22044957",
    "format": "arff",
    "id": "42791",
    "language": "English",
    "licence": "Public",
    "md5_checksum": "c5a5b68266ba4bce329a1ebc29523815",
    "name": "road-safety",
    "original_data_url": "https://data.gov.uk/dataset/cb7ae6f0-4be6-4935-9277-47e5ce24a11f/road-safety-data",
    "processing_date": "2021-01-20 17:55:19",
    "status": "active",
    "upload_date": "2021-01-20T17:54:13",
    "url": "https://www.openml.org/data/v1/download/22044957/road-safety.arff",
    "version": "3",
    "visibility": "public"
  }
}