{
  "data_set_description": {
    "description": "50 Danish words with their pronunciation from Dansk Ordbog",
    "description_version": "1",
    "file_id": "22044925",
    "format": "ARFF",
    "id": "42781",
    "licence": "CC0",
    "md5_checksum": "59758ddb5e99ccd292dcd044820e669f",
    "minio_url": "https://data.openml.org/datasets/0004/42781/dataset_42781.pq",
    "name": "danish_pronunciation",
    "parquet_url": "https://data.openml.org/datasets/0004/42781/dataset_42781.pq",
    "processing_date": "2021-01-03 01:15:03",
    "status": "active",
    "upload_date": "2021-01-03T01:15:01",
    "url": "https://api.openml.org/data/v1/download/22044925/danish_pronunciation.arff",
    "version": "1",
    "visibility": "public"
  }
}