{
  "data_qualities": {
    "quality": [
      {
        "name": "AutoCorrelation",
        "value": "0.8644572891457829"
      },
      {
        "name": "Dimensionality",
        "value": "0.30002"
      },
      {
        "name": "MajorityClassPercentage",
        "value": "92.656"
      },
      {
        "name": "MajorityClassSize",
        "value": "46328.0"
      },
      {
        "name": "MinorityClassPercentage",
        "value": "7.344"
      },
      {
        "name": "MinorityClassSize",
        "value": "3672.0"
      },
      {
        "name": "NumberOfBinaryFeatures",
        "value": "1.0"
      },
      {
        "name": "NumberOfClasses",
        "value": "2.0"
      },
      {
        "name": "NumberOfFeatures",
        "value": "15001.0"
      },
      {
        "name": "NumberOfInstances",
        "value": "50000.0"
      },
      {
        "name": "NumberOfInstancesWithMissingValues",
        "value": "50000.0"
      },
      {
        "name": "NumberOfMissingValues",
        "value": "2.5108569E7"
      },
      {
        "name": "NumberOfNumericFeatures",
        "value": "14811.0"
      },
      {
        "name": "NumberOfSymbolicFeatures",
        "value": "1.0"
      },
      {
        "name": "PercentageOfBinaryFeatures",
        "value": "0.006666222251849876"
      },
      {
        "name": "PercentageOfInstancesWithMissingValues",
        "value": "100.0"
      },
      {
        "name": "PercentageOfMissingValues",
        "value": "3.3475860275981604"
      },
      {
        "name": "PercentageOfNumericFeatures",
        "value": "98.73341777214853"
      },
      {
        "name": "PercentageOfSymbolicFeatures",
        "value": "0.006666222251849876"
      }
    ]
  }
}