{
  "data_set_description": {
    "citation": "Stolfo, S. J., Fan, W., Lee, W., Prodromidis, A., & Chan, P. K. (2000, January). Cost-based modeling for fraud and intrusion detection: Results from the JAM project. In Proceedings DARPA Information Survivability Conference and Exposition. DISCEX'00 (Vol. 2, pp. 130-144). IEEE.",
    "collection_date": "1999",
    "default_target_attribute": "target",
    "description": "INTRUSION DETECTOR LEARNING\n\nSoftware to detect network intrusions protects a computer network from unauthorized users, including perhaps insiders.  The intrusion detector learning task is to build a predictive model (i.e. a classifier) capable of distinguishing between \"bad\" connections, called intrusions or attacks, and \"good\" normal connections.\nThe 1998 DARPA Intrusion Detection Evaluation Program was prepared and managed by MIT Lincoln Labs. The objective was to survey and evaluate research in intrusion detection.  A standard set of data to be audited, which includes a wide variety of intrusions simulated in a military network environment, was provided.  The 1999 KDD intrusion detection contest uses a version of this dataset.\n\nLincoln Labs set up an environment to acquire nine weeks of raw TCP dump data for a local-area network (LAN) simulating a typical U.S. Air Force LAN.  They operated the LAN as if it were a true Air Force environment, but peppered it with multiple attacks.\n\nThe raw training data was about four gigabytes of compressed binary TCP dump data from seven weeks of network traffic.  This was processed into about five million connection records.  Similarly, the two weeks of test data yielded around two million connection records.\n\nA connection is a sequence of TCP packets starting and ending at some well defined times, between which data flows to and from a source IP address to a target IP address under some well defined protocol.  Each connection is labeled as either normal, or as an attack, with exactly one specific attack type.  Each connection record consists of about 100 bytes.\n\nAttacks fall into four main categories:\n\n* DOS: denial-of-service, e.g. syn flood;\n* R2L: unauthorized access from a remote machine, e.g. guessing password;\n* U2R:  unauthorized access to local superuser (root) privileges, e.g., various \"buffer overflow\" attacks;\n* probing: surveillance and other probing, e.g., port scanning.\nIt is important to note that the test data is not from the same probability distribution as the training data, and it includes specific attack types not in the training data.  This makes the task more realistic.  Some intrusion experts believe that most novel attacks are variants of known attacks and the \"signature\" of known attacks can be sufficient to catch novel variants.  The datasets contain a total of 24 training attack types, with an additional 14 types in the test data only. \n  \n \nDERIVED FEATURES\n\nStolfo et al. defined higher-level features that help in distinguishing normal connections from attacks.  There are several categories of derived features.\nThe \"same host\" features examine only the connections in the past two seconds that have the same destination host as the current connection, and calculate statistics related to protocol behavior, service, etc.\n\nThe similar \"same service\" features examine only the connections in the past two seconds that have the same service as the current connection.\n\n\"Same host\" and \"same service\" features are together called  time-based traffic features of the connection records.\n\nSome probing attacks scan the hosts (or ports) using a much larger time interval than two seconds, for example once per minute.  Therefore, connection records were also sorted by destination host, and features were constructed using a window of 100 connections to the same host instead of a time window.  This yields a set of so-called host-based traffic features.\n\nUnlike most of the DOS and probing attacks, there appear to be no sequential patterns that are frequent in records of R2L and U2R attacks. This is because the DOS and probing attacks involve many connections to some host(s) in a very short period of time, but the R2L and U2R attacks are embedded in the data portions \nof packets, and normally involve only a single connection.\n\nUseful algorithms for mining the unstructured data portions of packets automatically are an open research question.  Stolfo et al. used domain knowledge to add features that look for suspicious behavior in the data portions, such as the number of failed login attempts.  These features are called \"content\" features.\n\nA complete listing of the set of features defined for the connection records is given in the three tables below.  The data schema of the contest dataset is available in machine-readable form . \n  \n \n\nfeature namedescription \ttype\n\n* duration \tlength (number of seconds) of the connection \tcontinuous\n* protocol_type \ttype of the protocol, e.g. tcp, udp, etc. \tdiscrete\n* service \tnetwork service on the destination, e.g., http, telnet, etc. \tdiscrete\n* src_bytes \tnumber of data bytes from source to destination \tcontinuous\n* dst_bytes \tnumber of data bytes from destination to source \tcontinuous\n* flag \tnormal or error status of the connection \tdiscrete \n* land \t1 if connection is from/to the same host/port; 0 otherwise \tdiscrete\n* wrong_fragment \tnumber of \"wrong\" fragments \tcontinuous\n* urgent \tnumber of urgent packets \tcontinuous\n  \nTable 1: Basic features of individual TCP connections.\n \nfeature namedescription \ttype\n\n* hot \tnumber of \"hot\" indicatorscontinuous\n* num_failed_logins \tnumber of failed login attempts \tcontinuous\n* logged_in \t1 if successfully logged in; 0 otherwise \tdiscrete\n* num_compromised \tnumber of \"compromised\" conditions \tcontinuous\n* root_shell \t1 if root shell is obtained; 0 otherwise \tdiscrete\n* su_attempted \t1 if \"su root\" command attempted; 0 otherwise \tdiscrete\n* num_root \tnumber of \"root\" accesses \tcontinuous\n* num_file_creations \tnumber of file creation operations \tcontinuous\n* num_shells \tnumber of shell prompts \tcontinuous\n* num_access_files \tnumber of operations on access control files \tcontinuous\n* num_outbound_cmdsnumber of outbound commands in an ftp session \tcontinuous\n* is_hot_login \t1 if the login belongs to the \"hot\" list; 0 otherwise \tdiscrete\n* is_guest_login \t1 if the login is a \"guest\"login; 0 otherwise \tdiscrete\n  \nTable 2: Content features within a connection suggested by domain knowledge.\n \nfeature namedescription \ttype\n\n* count \tnumber of connections to the same host as the current connection in the past two seconds \tcontinuous\nNote: The following  features refer to these same-host connections.\n* serror_rate \t% of connections that have \"SYN\" errors \tcontinuous\n* rerror_rate \t% of connections that have \"REJ\" errors \tcontinuous\n* same_srv_rate \t% of connections to the same service \tcontinuous\n* diff_srv_rate \t% of connections to different services \tcontinuous\n* srv_count \tnumber of connections to the same service as the current connection in the past two seconds \tcontinuous\nNote: The following features refer to these same-service connections.\n* srv_serror_rate \t% of connections that have \"SYN\" errors \tcontinuous\n* srv_rerror_rate \t% of connections that have \"REJ\" errors \tcontinuous\n* srv_diff_host_rate \t% of connections to different hosts \tcontinuous \n  \nTable 3: Traffic features computed using a two-second time window.",
    "description_version": "1",
    "file_id": "22044822",
    "format": "arff",
    "id": "42746",
    "language": "English",
    "licence": "Public",
    "md5_checksum": "9f61c36b09c3f4bee8af91d2cf98e777",
    "minio_url": "https://data.openml.org/datasets/0004/42746/dataset_42746.pq",
    "name": "KDDCup99",
    "original_data_url": "http://kdd.ics.uci.edu/databases/kddcup99/kddcup99.html",
    "parquet_url": "https://data.openml.org/datasets/0004/42746/dataset_42746.pq",
    "processing_date": "2020-12-04 00:12:01",
    "status": "active",
    "upload_date": "2020-12-04T00:09:23",
    "url": "https://api.openml.org/data/v1/download/22044822/KDDCup99.arff",
    "version": "5",
    "visibility": "public"
  }
}